BDBM50504015 CHEMBL4555101
SMILES CNC(=O)NCCN(CCc1ccc(Cl)cc1)C1CCN(CC1)c1nc(N)n[nH]1
InChI Key InChIKey=ARWWVAZVGCKBKL-UHFFFAOYSA-N
Data  5 IC50
  Tab Delimited (TSV)   2D SDfile   Computed 3D by Vconf -m prep SDfile
Find this compound or compounds like it in BindingDB:
Activity Spreadsheet -- Enzyme Inhibition Constant Data from BindingDB
Found 5 hits for monomerid = 50504015
TargetChitotriosidase-1(Mus musculus)
Oncoarendi Therapeutics
Curated by ChEMBL
LigandPNGBDBM50504015(CHEMBL4555101)
Affinity DataIC50:  9.10E+3nM. Assay description: Inhibition of full-length C-terminal his-tagged mouse CHIT1 expressed in CHO-K1 cells assessed as reduction in chitinolytic activity using 4-methylum...
Ligand InfoPC cidPC sid
In DepthDetails ArticlePubMed
TargetPotassium voltage-gated channel subfamily H member 2(Homo sapiens (Human))
Oncoarendi Therapeutics
Curated by ChEMBL
LigandPNGBDBM50504015(CHEMBL4555101)
Affinity DataIC50:  1.80E+3nM. Assay description: Displacement of Tracer Red from human ERG by fluorescence polarization assay
Ligand InfoPC cidPC sid
In DepthDetails ArticlePubMed
TargetAcidic mammalian chitinase(Mus musculus)
Oncoarendi Therapeutics
Curated by ChEMBL
LigandPNGBDBM50504015(CHEMBL4555101)
Affinity DataIC50:  130nM. Assay description: Inhibition of full-length C-terminal his-tagged mouse acidic mammalian chitinase expressed in CHO-K1 cells assessed as reduction in chitinolytic acti...
Ligand InfoPC cidPC sid
In DepthDetails ArticlePubMed
TargetAcidic mammalian chitinase(Homo sapiens (Human))
Oncoarendi Therapeutics
Curated by ChEMBL
LigandPNGBDBM50504015(CHEMBL4555101)
Affinity DataIC50:  425nM. Assay description: Inhibition of full-length C-terminal his-tagged human acidic mammalian chitinase expressed in CHOK1 cells assessed as reduction in chitinolytic activ...
Ligand InfoPC cidPC sid
In DepthDetails ArticlePubMed
TargetChitotriosidase-1(Homo sapiens (Human))
Oncoarendi Therapeutics
Curated by ChEMBL
LigandPNGBDBM50504015(CHEMBL4555101)
Affinity DataIC50:  1.43E+3nM. Assay description: Inhibition of full-length C-terminal his-tagged human CHIT1 expressed in CHOK1 cells assessed as reduction in chitinolytic activity using 4-methylumb...
Ligand InfoPC cidPC sid
In DepthDetails ArticlePubMed