BDBM50504061 CHEMBL4452849
SMILES CCOC(=O)c1ccccc1C(=O)c1cccc2ccccc12
InChI Key InChIKey=DJUCLJRFJOTXIK-UHFFFAOYSA-N
Data  1 KI
  Tab Delimited (TSV)   2D SDfile   Computed 3D by Vconf -m prep SDfile
Find this compound or compounds like it in BindingDB:
Activity Spreadsheet -- Enzyme Inhibition Constant Data from BindingDB
Found 1 hit for monomerid = 50504061
TargetM-phase inducer phosphatase 2(Homo sapiens (Human))
University Of Naples Federico Ii
Curated by ChEMBL
LigandPNGBDBM50504061(CHEMBL4452849)
Affinity DataKi:  5.40E+4nM. Assay description: Mixed inhibition of N-terminal His6-tagged human CDC25B (377 to 550 residues) expressed in Escherichia coli BL21(DE3) cells using OMFP as substrate b...
Ligand InfoPC cidPC sid
In DepthDetails ArticlePubMed