BDBM50505051 CHEMBL4437940
SMILES Cn1ncc(NC(=O)c2nc(sc2N)-c2c(F)cccc2F)c1N1CCC[C@H](N)CC1
InChI Key InChIKey=JEVIKKKBDOXJFA-NSHDSACASA-N
Data  3 KI
  Tab Delimited (TSV)   2D SDfile   Computed 3D by Vconf -m prep SDfile
Find this compound or compounds like it in BindingDB:
Activity Spreadsheet -- Enzyme Inhibition Constant Data from BindingDB
Found 3 hits for monomerid = 50505051
TargetSerine/threonine-protein kinase pim-3(Homo sapiens (Human))
Genentech
Curated by ChEMBL
LigandPNGBDBM50505051(CHEMBL4437940)
Affinity DataKi:  0.00700nM. Assay description: Inhibition of recombinant human PIM3 using FAM-pimtide as substrate after 90 mins by Z-LYTE assay
Ligand InfoPC cidPC sid
In DepthDetails ArticlePubMed
TargetSerine/threonine-protein kinase pim-1(Homo sapiens (Human))
Genentech
Curated by ChEMBL
LigandPNGBDBM50505051(CHEMBL4437940)
Affinity DataKi:  0.0200nM. Assay description: Inhibition of recombinant human PIM1 using FAM-pimtide as substrate after 90 mins by Z-LYTE assay
Ligand InfoPC cidPC sid
In DepthDetails ArticlePubMed
TargetSerine/threonine-protein kinase pim-2(Homo sapiens (Human))
Genentech
Curated by ChEMBL
LigandPNGBDBM50505051(CHEMBL4437940)
Affinity DataKi:  0.100nM. Assay description: Inhibition of recombinant human PIM2 using FAM-pimtide as substrate after 90 mins by Z-LYTE assay
Ligand InfoPC cidPC sid
In DepthDetails ArticlePubMed