BDBM50506353 CHEMBL4543158
SMILES Cl.Cl.Cc1n[nH]cc1-c1cc2nc([nH]c(=O)c2s1)[C@@H]1CC=CCN1
InChI Key InChIKey=LFJQRKMIGRCACZ-XRIOVQLTSA-N
Data  3 IC50
  Tab Delimited (TSV)   2D SDfile   Computed 3D by Vconf -m prep SDfile
Find this compound or compounds like it in BindingDB:
Activity Spreadsheet -- Enzyme Inhibition Constant Data from BindingDB
Found 3 hits for monomerid = 50506353
TargetCell division cycle 7-related protein kinase/Protein DBF4 homolog A(Homo sapiens (Human))
Takeda Pharmaceutical
Curated by ChEMBL
LigandPNGBDBM50506353(CHEMBL4543158)
Affinity DataIC50:  0.530nM. Assay description: Inhibition of N-terminal GST-fused full-length human CDC7 (1 to 574 end residues)/DBF4 (1 to 674 residues) expressed in baculovirus expression system...
Ligand InfoPC cidPC sid
In DepthDetails ArticlePubMed
TargetRho-associated protein kinase 1(Homo sapiens (Human))
Takeda Pharmaceutical
Curated by ChEMBL
LigandPNGBDBM50506353(CHEMBL4543158)
Affinity DataIC50:  340nM. Assay description: Inhibition of N-terminal GST-tagged human ROCK1 catalytic domain (1 to 477 residues) expressed in baculovirus expression system using biotin-STK-subs...
Ligand InfoPC cidPC sid
In DepthDetails ArticlePubMed
TargetCyclin-dependent kinase 2/G1/S-specific cyclin-E1(Homo sapiens (Human))
Takeda Pharmaceutical
Curated by ChEMBL
LigandPNGBDBM50506353(CHEMBL4543158)
Affinity DataIC50:  4.70E+3nM. Assay description: Inhibition of N-terminal GST-tagged full-length human CDK2 (1 to 298 residues)/Cyclin E (1 to 410 residues) expressed in baculovirus expression syste...
Ligand InfoPC cidPC sid
In DepthDetails ArticlePubMed