BDBM50507307 CHEMBL4456204
SMILES O=C(N([C@@H]1CCCNC1)c1nccc2ccccc12)N1CCN(CC1)c1ccccc1
InChI Key InChIKey=LBCTXCODKBBZDD-JOCHJYFZSA-N
Data  1 KI
  Tab Delimited (TSV)   2D SDfile   Computed 3D by Vconf -m prep SDfile
Find this compound or compounds like it in BindingDB:
Activity Spreadsheet -- Enzyme Inhibition Constant Data from BindingDB
Found 1 hit for monomerid = 50507307
TargetPotassium voltage-gated channel subfamily H member 2(Homo sapiens (Human))
Pfizer
Curated by ChEMBL
LigandPNGBDBM50507307(CHEMBL4456204)
Affinity DataKi:  9.20E+3nM. Assay description: Binding affinity to human ERG by dofetilide fluorescence polarization binding assay
Ligand InfoPC cidPC sid
In DepthDetails ArticlePubMed