BDBM50509009 CHEMBL4530103
SMILES C[C@@H](N)CN1C[C@H](CCCB(O)O)[C@@](N)(C1)C(O)=O
InChI Key InChIKey=NRUYFUDQNNLGKO-YWVKMMECSA-N
Data  1 IC50
  Tab Delimited (TSV)   2D SDfile   Computed 3D by Vconf -m prep SDfile
Find this compound or compounds like it in BindingDB:
Activity Spreadsheet -- Enzyme Inhibition Constant Data from BindingDB
Found 1 hit for monomerid = 50509009
TargetArginase-1(Homo sapiens (Human))
New England Discovery Partners
Curated by ChEMBL
LigandPNGBDBM50509009(CHEMBL4530103)
Affinity DataIC50:  16nM. Assay description: Inhibition of human recombinant arginase 1 expressed in Escherichia coli BL21 (DE3) assessed as reduction in urea production using L-arginine as subs...
Ligand InfoPC cidPC sid
In DepthDetails ArticlePubMed