BDBM50512620 CHEMBL4461224
SMILES COc1cc2c(NC3CCN(C)CC3)nc(nc2cc1CCCN(C)C)N1CCCN(C)CC1
InChI Key InChIKey=ONQXWOCNSKDACO-UHFFFAOYSA-N
Data  2 IC50
  Tab Delimited (TSV)   2D SDfile   Computed 3D by Vconf -m prep SDfile
Find this compound or compounds like it in BindingDB:
Activity Spreadsheet -- Enzyme Inhibition Constant Data from BindingDB
Found 2 hits for monomerid = 50512620
TargetHistone-lysine N-methyltransferase EHMT1(Homo sapiens (Human))
Mercachem
Curated by ChEMBL
LigandPNGBDBM50512620(CHEMBL4461224)
Affinity DataIC50:  9nM. Assay description: Inhibition of N-terminal GST tagged human recombinant EHMT1 (794 to 1294 residues) expressed in baculovirus infected Sf9 insect cells assessed as red...
Ligand InfoPC cidPC sid
In DepthDetails ArticlePubMed
TargetHistone-lysine N-methyltransferase EHMT2(Homo sapiens (Human))
Mercachem
Curated by ChEMBL
LigandPNGBDBM50512620(CHEMBL4461224)
Affinity DataIC50:  15nM. Assay description: Inhibition of N-terminal GST tagged human recombinant EHMT2 (785 to 1210 residues) expressed in baculovirus infected Sf9 insect cells assessed as red...
Ligand InfoPC cidPC sid
In DepthDetails ArticlePubMed