BDBM50514116 CHEMBL4458718
SMILES [H][C@@]1(CC[C@]2([H])[C@]1(C)CC[C@@]1([H])[C@@]2(C)CC[C@]2([H])C[C@H](O)CC[C@]12C)[C@H](C)CCC(=O)NO
InChI Key InChIKey=GBSNSEDVZHDRTA-KRNRSIDESA-N
Data  1 IC50
  Tab Delimited (TSV)   2D SDfile   Computed 3D by Vconf -m prep SDfile
Find this compound or compounds like it in BindingDB:
Activity Spreadsheet -- Enzyme Inhibition Constant Data from BindingDB
Found 1 hit for monomerid = 50514116
TargetUbiquitin carboxyl-terminal hydrolase 2(Homo sapiens (Human))
Dana-Farber Cancer Institute
Curated by ChEMBL
LigandPNGBDBM50514116(CHEMBL4458718)
Affinity DataIC50:  9.70E+3nM. Assay description: Inhibition of USP2 (unknown origin) using Ub-AMC substrate
Ligand InfoPC cidPC sid
In DepthDetails ArticlePubMed