BDBM50514389 CHEMBL4439782
SMILES CC(C)c1ccccc1-n1c2nc(c(Cl)cc2c(nc1=O)N1CCN(CC1)C(=O)C=C)-c1c(O)cccc1F
InChI Key InChIKey=UMMHCXMLOADCEX-UHFFFAOYSA-N
Data  1 IC50
  Tab Delimited (TSV)   2D SDfile   Computed 3D by Vconf -m prep SDfile
Find this compound or compounds like it in BindingDB:
Activity Spreadsheet -- Enzyme Inhibition Constant Data from BindingDB
Found 1 hit for monomerid = 50514389
TargetGTPase KRas(Homo sapiens (Human))
TBA
Curated by ChEMBL
LigandPNGBDBM50514389(CHEMBL4439782)
Affinity DataIC50:  69nM. Assay description: Inhibition of KRAS in human MIAPaca2 cells assessed as decrease in EGF-stimulated ERK1/2 phosphorylation preincubated for 2 hrs followed by EGF stimu...
Ligand InfoPC cidPC sid
In DepthDetails ArticlePubMed