BDBM50514924 CHEMBL4568867
SMILES O=C(Nc1cc2sc(nc2cc1N1CCOCC1)N1CCOCC1)c1cnn2cccnc12
InChI Key InChIKey=FEJCKYYKSNIWCL-UHFFFAOYSA-N
Data  2 KI  1 IC50
  Tab Delimited (TSV)   2D SDfile   Computed 3D by Vconf -m prep SDfile
Find this compound or compounds like it in BindingDB:
Activity Spreadsheet -- Enzyme Inhibition Constant Data from BindingDB
Found 3 hits for monomerid = 50514924
TargetInterleukin-1 receptor-associated kinase 4(Homo sapiens (Human))
Genentech
Curated by ChEMBL
LigandPNGBDBM50514924(CHEMBL4568867)
Affinity DataKi:  0.800nM. Assay description: Inhibition of human recombinant full length His6-tagged IRAK4 expressed in baculovirus expression system using H-KKARFSRFAGSSPSQSSMVAR as substrate i...
Ligand InfoPC cidPC sid
In DepthDetails ArticlePubMed
TargetInterleukin-1 receptor-associated kinase 1(Homo sapiens (Human))
Genentech
Curated by ChEMBL
LigandPNGBDBM50514924(CHEMBL4568867)
Affinity DataKi:  190nM. Assay description: Inhibition of human recombinant full length N-terminal His6-tagged IRAK1 (Argl94 to Ser712 residues) expressed in insect cells using H-KKARFSRFAGSSPS...
Ligand InfoPC cidPC sid
In DepthDetails ArticlePubMed
TargetInterleukin-1 receptor-associated kinase 4(Homo sapiens (Human))
Genentech
Curated by ChEMBL
LigandPNGBDBM50514924(CHEMBL4568867)
Affinity DataIC50:  76nM. Assay description: Inhibition of IRAK4 in human THP1-Xblue-MD2-CD14 cells assessed as reduction in LPS-induced NFkappaB transcription by measuring alkaline phosphatase ...
Ligand InfoPC cidPC sid
In DepthDetails ArticlePubMed