BDBM50515938 CHEMBL4473110
SMILES COc1cccc(c1)C(=O)Cn1c2cc(F)ccc2oc1=O
InChI Key InChIKey=HNKJSOMMEONNEZ-UHFFFAOYSA-N
Data  3 Kd
  Tab Delimited (TSV)   2D SDfile   Computed 3D by Vconf -m prep SDfile
Find this compound or compounds like it in BindingDB:
Activity Spreadsheet -- Enzyme Inhibition Constant Data from BindingDB
Found 3 hits for monomerid = 50515938
TargetChromobox protein homolog 7(Homo sapiens (Human))
Peking University
Curated by ChEMBL
LigandPNGBDBM50515938(CHEMBL4473110)
Affinity DataKd:  3.40E+3nM. Assay description: Binding affinity to recombinant human N-terminal GST-tagged CBX7 (1 to 62 residues) expressed in Escherichia coli BL2 by SPR analysis
Ligand InfoPC cidPC sid
In DepthDetails ArticlePubMed
TargetChromodomain Y-like protein 2(Homo sapiens (Human))
Peking University
Curated by ChEMBL
LigandPNGBDBM50515938(CHEMBL4473110)
Affinity DataKd:  2.87E+4nM. Assay description: Binding affinity to recombinant human N-terminal GST-tagged CDYL2 (1 to 70 residues) expressed in Escherichia coli BL2 by SPR analysis
Ligand InfoPC cidPC sid
In DepthDetails ArticlePubMed
TargetChromodomain Y-like protein(Homo sapiens (Human))
Peking University
Curated by ChEMBL
LigandPNGBDBM50515938(CHEMBL4473110)
Affinity DataKd:  6.20E+3nM. Assay description: Binding affinity to recombinant human N-terminal GST-tagged CDYL (1 to 60 residues) expressed in Escherichia coli BL2 by SPR analysis
Ligand InfoPC cidPC sid
In DepthDetails ArticlePubMed