BDBM50516946 CHEMBL4549350
SMILES [H][C@@]12CN(C[C@]1([H])N(CCC2)C(=O)Cn1cc(CN2C(=O)C(=O)c3ccccc23)nn1)c1c(F)cc2c(c1OC)n(cc(C(O)=O)c2=O)C1CC1
InChI Key InChIKey=FHBUITBJKXGEHE-DWXRJYCRSA-N
Data  1 IC50
  Tab Delimited (TSV)   2D SDfile   Computed 3D by Vconf -m prep SDfile
Find this compound or compounds like it in BindingDB:
Activity Spreadsheet -- Enzyme Inhibition Constant Data from BindingDB
Found 1 hit for monomerid = 50516946
TargetDNA gyrase subunit B(Mycobacterium tuberculosis (strain ATCC 25618 / H3...)
Medical School Of Nanjing University
Curated by ChEMBL
LigandPNGBDBM50516946(CHEMBL4549350)
Affinity DataIC50:  5.97E+3nM. Assay description: Inhibition of Mycobacterium tuberculosis DNA gyrase
Ligand InfoPC cidPC sid
In DepthDetails ArticlePubMed