BDBM50517596 CHEMBL4450505
SMILES CC(C)C[C@H](NC(=O)[C@H](CC1CCCCC1)NC(=O)c1cnc(C)s1)C(=O)N[C@@H](Cc1ccc(CN)cc1)\C=C\S(C)(=O)=O
InChI Key InChIKey=DYMSMUGVJHOWOY-WHYQKWHESA-N
Data  14 IC50
  Tab Delimited (TSV)   2D SDfile   Computed 3D by Vconf -m prep SDfile
Find this compound or compounds like it in BindingDB:
Activity Spreadsheet -- Enzyme Inhibition Constant Data from BindingDB
Found 14 hits for monomerid = 50517596
TargetProteasome subunit beta type-2(Homo sapiens (Human))
Leiden Institute Of Chemistry And Netherlands Proteomics Centre
Curated by ChEMBL
LigandPNGBDBM50517596(CHEMBL4450505)
Affinity DataIC50:  18nM. Assay description: Inhibition of 20S constitutive proteasome beta 2 trypsin-like activity (unknown origin) by cell based ABPP assay
Ligand InfoPC cidPC sid
In DepthDetails ArticlePubMed
TargetProteasome subunit beta type-10(Homo sapiens (Human))
Leiden Institute Of Chemistry And Netherlands Proteomics Centre
Curated by ChEMBL
LigandPNGBDBM50517596(CHEMBL4450505)
Affinity DataIC50:  540nM. Assay description: Inhibition of 20S immunoproteasome beta 2 (unknown origin) by cell based ABPP assay
Ligand InfoPC cidPC sid
In DepthDetails ArticlePubMed
TargetProteasome subunit beta type-2(Homo sapiens (Human))
Leiden Institute Of Chemistry And Netherlands Proteomics Centre
Curated by ChEMBL
LigandPNGBDBM50517596(CHEMBL4450505)
Affinity DataIC50:  65nM. Assay description: Inhibition of 20S constitutive proteasome beta 2 trypsin-like activity in human Raji cell lysates after 1 hr by competitive ABPP assay
Ligand InfoPC cidPC sid
In DepthDetails ArticlePubMed
TargetProteasome subunit beta type-5(Homo sapiens (Human))
Leiden Institute Of Chemistry And Netherlands Proteomics Centre
Curated by ChEMBL
LigandPNGBDBM50517596(CHEMBL4450505)
Affinity DataIC50: >1.00E+5nM. Assay description: Inhibition of 20S constitutive proteasome beta 5 chymotrypsin-like activity in human Raji cell lysates after 1 hr by competitive ABPP assay
Ligand InfoPC cidPC sid
In DepthDetails ArticlePubMed
TargetProteasome subunit beta type-10(Homo sapiens (Human))
Leiden Institute Of Chemistry And Netherlands Proteomics Centre
Curated by ChEMBL
LigandPNGBDBM50517596(CHEMBL4450505)
Affinity DataIC50: >1.00E+4nM. Assay description: Inhibition of 20S immunoproteasome beta 2 in human RPMI8226 cell lysates after 1 hr by coomassie brilliant blue staining-based fluorescence assay
Ligand InfoPC cidPC sid
In DepthDetails ArticlePubMed
TargetProteasome subunit beta type-5(Homo sapiens (Human))
Leiden Institute Of Chemistry And Netherlands Proteomics Centre
Curated by ChEMBL
LigandPNGBDBM50517596(CHEMBL4450505)
Affinity DataIC50: >1.00E+4nM. Assay description: Inhibition of 20S constitutive proteasome beta 5 chymotrypsin-like activity in human RPMI8226 cell lysates after 1 hr by coomassie brilliant blue sta...
Ligand InfoPC cidPC sid
In DepthDetails ArticlePubMed
TargetProteasome subunit beta type-2(Homo sapiens (Human))
Leiden Institute Of Chemistry And Netherlands Proteomics Centre
Curated by ChEMBL
LigandPNGBDBM50517596(CHEMBL4450505)
Affinity DataIC50: >1.00E+4nM. Assay description: Inhibition of 20S constitutive proteasome beta 2 trypsin-like activity in human RPMI8226 cell lysates after 1 hr by coomassie brilliant blue staining...
Ligand InfoPC cidPC sid
In DepthDetails ArticlePubMed
TargetProteasome subunit beta type-9(Homo sapiens (Human))
Leiden Institute Of Chemistry And Netherlands Proteomics Centre
Curated by ChEMBL
LigandPNGBDBM50517596(CHEMBL4450505)
Affinity DataIC50: >1.00E+4nM. Assay description: Inhibition of 20S immunoproteasome beta 1 in human RPMI8226 cell lysates after 1 hr by coomassie brilliant blue staining-based fluorescence assay
Ligand InfoPC cidPC sid
In DepthDetails ArticlePubMed
TargetProteasome subunit beta type-8(Homo sapiens (Human))
Leiden Institute Of Chemistry And Netherlands Proteomics Centre
Curated by ChEMBL
LigandPNGBDBM50517596(CHEMBL4450505)
Affinity DataIC50: >1.00E+5nM. Assay description: Inhibition of 20S immunoproteasome beta 5 in human Raji cell lysates after 1 hr by competitive ABPP assay
Ligand InfoPC cidPC sid
In DepthDetails ArticlePubMed
TargetProteasome subunit beta type-9(Homo sapiens (Human))
Leiden Institute Of Chemistry And Netherlands Proteomics Centre
Curated by ChEMBL
LigandPNGBDBM50517596(CHEMBL4450505)
Affinity DataIC50: >1.00E+5nM. Assay description: Inhibition of 20S immunoproteasome beta 1 in human Raji cell lysates after 1 hr by competitive ABPP assay
Ligand InfoPC cidPC sid
In DepthDetails ArticlePubMed
TargetProteasome subunit beta type-10(Homo sapiens (Human))
Leiden Institute Of Chemistry And Netherlands Proteomics Centre
Curated by ChEMBL
LigandPNGBDBM50517596(CHEMBL4450505)
Affinity DataIC50:  420nM. Assay description: Inhibition of 20S immunoproteasome beta 2 in human Raji cell lysates after 1 hr by competitive ABPP assay
Ligand InfoPC cidPC sid
In DepthDetails ArticlePubMed
TargetProteasome subunit beta type-1(Homo sapiens (Human))
Leiden Institute Of Chemistry And Netherlands Proteomics Centre
Curated by ChEMBL
LigandPNGBDBM50517596(CHEMBL4450505)
Affinity DataIC50: >1.00E+4nM. Assay description: Inhibition of 20S constitutive proteasome beta 1 caspase-like activity in human RPMI8226 cell lysates after 1 hr by coomassie brilliant blue staining...
Ligand InfoPC cidPC sid
In DepthDetails ArticlePubMed
TargetProteasome subunit beta type-1(Homo sapiens (Human))
Leiden Institute Of Chemistry And Netherlands Proteomics Centre
Curated by ChEMBL
LigandPNGBDBM50517596(CHEMBL4450505)
Affinity DataIC50: >1.00E+5nM. Assay description: Inhibition of 20S constitutive proteasome beta 1 caspase-like activity in human Raji cell lysates after 1 hr by competitive ABPP assay
Ligand InfoPC cidPC sid
In DepthDetails ArticlePubMed
TargetProteasome subunit beta type-8(Homo sapiens (Human))
Leiden Institute Of Chemistry And Netherlands Proteomics Centre
Curated by ChEMBL
LigandPNGBDBM50517596(CHEMBL4450505)
Affinity DataIC50: >1.00E+4nM. Assay description: Inhibition of 20S immunoproteasome beta 5 in human RPMI8226 cell lysates after 1 hr by coomassie brilliant blue staining-based fluorescence assay
Ligand InfoPC cidPC sid
In DepthDetails ArticlePubMed