BDBM50518063 CHEMBL4465236
SMILES O=C(CCNCC1COc2ccccc2O1)N1CCc2nc(SC3CCC3)n(-c3ccccc3)c(=O)c2C1
InChI Key InChIKey=FQWOVXXZSLCPOJ-UHFFFAOYSA-N
Data  1 IC50
  Tab Delimited (TSV)   2D SDfile   Computed 3D by Vconf -m prep SDfile
Find this compound or compounds like it in BindingDB:
Activity Spreadsheet -- Enzyme Inhibition Constant Data from BindingDB
Found 1 hit for monomerid = 50518063
LigandPNGBDBM50518063(CHEMBL4465236)
Affinity DataIC50:  1.10nM. Assay description: Inhibition of recombinant human MGAT2
Ligand InfoPC cidPC sid
In DepthDetails ArticlePubMed