BDBM50518207 CHEMBL4446033
SMILES CC[C@H](C)[C@H](NC(C)=O)C(=O)N[C@@H](Cc1c[nH]c2ccccc12)C(=O)N[C@@H]([C@@H](C)CC)C(=O)N[C@@H](C)C(=O)N[C@@H](CCC(N)=O)C(=O)N[C@@H](CCC(O)=O)C(=O)N[C@@H](CC(C)C)C(=O)N[C@@H](CCCNC(N)=N)C(=O)N[C@@H](CCCNC(N)=N)C(=O)N[C@@H]([C@@H](C)CC)C(=O)NCC(=O)N[C@@H](CC(O)=O)C(=O)N[C@@H](CCC(O)=O)C(=O)N[C@@H](Cc1ccccc1)C(N)=O
InChI Key InChIKey=MGRFYASROPCVOS-ZSZODMRBSA-N
Data  1 Kd
  Tab Delimited (TSV)   2D SDfile   Computed 3D by Vconf -m prep SDfile
Find this compound or compounds like it in BindingDB:
Activity Spreadsheet -- Enzyme Inhibition Constant Data from BindingDB
Found 1 hit for monomerid = 50518207
TargetTyrosine-protein phosphatase non-receptor type 1(Homo sapiens (Human))
Ocean University Of China
Curated by ChEMBL
LigandPNGBDBM50518207(CHEMBL4446033)
Affinity DataKd:  128nM. Assay description: Binding affinity to recombinant human N-terminal poly histidine-tagged PTP1B (Glu2 to Asn321 residues) expressed in Escherichia coli by surface plasm...
Ligand InfoPC cidPC sid
In DepthDetails ArticlePubMed