BDBM50518836 CHEMBL4568429::US10829446, Compound 148
SMILES Cc1cccc(c1)C(=O)NNS(=O)(=O)c1ccc2ccccc2c1
InChI Key InChIKey=VCHSTNXFNJXQBW-UHFFFAOYSA-N
Data  3 IC50
  Tab Delimited (TSV)   2D SDfile   Computed 3D by Vconf -m prep SDfile
Find this compound or compounds like it in BindingDB:
Activity Spreadsheet -- Enzyme Inhibition Constant Data from BindingDB
Found 3 hits for monomerid = 50518836
TargetHistone acetyltransferase KAT6A [507-778](Homo sapiens)
Cancer Therapeutics Crc
Curated by ChEMBL
LigandPNGBDBM50518836(CHEMBL4568429 | US10829446, Compound 148)
Affinity DataIC50:  1.80E+4nM. Assay description: Inhibition of N-terminal NusA-fused His6-tagged human KAT6A (507 to 778 residues) expressed in Escherichia coli BL21 (DE3) cells using 15 uM acetyl c...
In DepthDetails ArticlePubMed
TargetHistone acetyltransferase KAT6A [507-778](Homo sapiens)
Cancer Therapeutics Crc
Curated by ChEMBL
LigandPNGBDBM50518836(CHEMBL4568429 | US10829446, Compound 148)
Affinity DataIC50:  1.77E+3nM. Assay description: Active Moz protein was expressed as N-terminal fusion protein with a His6 tag in BL21 E. coli cells. Protein purification was performed via nickel-im...
In DepthDetails US Patent
TargetHistone acetyltransferase KAT6A [507-778](Homo sapiens)
Cancer Therapeutics Crc
Curated by ChEMBL
LigandPNGBDBM50518836(CHEMBL4568429 | US10829446, Compound 148)
Affinity DataIC50:  1.40E+3nM. Assay description: Inhibition of N-terminal NusA-fused His6-tagged human KAT6A (507 to 778 residues) expressed in Escherichia coli BL21 (DE3) cells using 0.4 uM acetyl ...
In DepthDetails ArticlePubMed