BDBM50519565 CHEMBL4441362
SMILES COc1cc(cnc1C(=O)[C@H]1C[C@@H]1C(O)=O)N(CC1CC1)c1ccc(F)c2ccccc12
InChI Key InChIKey=WTRVUWXJDQYQJK-OALUTQOASA-N
Data  3 IC50
  Tab Delimited (TSV)   2D SDfile   Computed 3D by Vconf -m prep SDfile
Find this compound or compounds like it in BindingDB:
Activity Spreadsheet -- Enzyme Inhibition Constant Data from BindingDB
Found 3 hits for monomerid = 50519565
TargetLeukotriene C4 synthase(Homo sapiens (Human))
Orexo
Curated by ChEMBL
LigandPNGBDBM50519565(CHEMBL4441362)
Affinity DataIC50:  0.758nM. Assay description: Inhibition of human N-terminal His6-tagged LTC4S expressed in Pichia pastoris X33 using LTA4 methyl ester and glutathione as substrate preincubated f...
Ligand InfoPC cidPC sid
In DepthDetails ArticlePubMed
TargetLeukotriene C4 synthase(Homo sapiens (Human))
Orexo
Curated by ChEMBL
LigandPNGBDBM50519565(CHEMBL4441362)
Affinity DataIC50:  27nM. Assay description: Inhibition of LTC4S in zymosan-stimulated human PBMC assessed as inhibition of LTC4 production preincubated for 45 mins followed by zymosan stimulati...
Ligand InfoPC cidPC sid
In DepthDetails ArticlePubMed
TargetLeukotriene C4 synthase(Homo sapiens (Human))
Orexo
Curated by ChEMBL
LigandPNGBDBM50519565(CHEMBL4441362)
Affinity DataIC50: <25nM. Assay description: Inhibition of recombinant human N-terminal His6-tagged LTC4S expressed in in Pichia pastoris X33 assessed as inhibition of EXC4 formation using EXA4 ...
Ligand InfoPC cidPC sid
In DepthDetails ArticlePubMed