BDBM50519573 CHEMBL4456770
SMILES COc1nc(ncc1N(CC1CC1)c1ccc(Cl)c2ccccc12)C(=O)[C@@H]1C[C@H]1C(O)=O
InChI Key InChIKey=DDLXCVVUOUQRRH-IAGOWNOFSA-N
Data  1 IC50
  Tab Delimited (TSV)   2D SDfile   Computed 3D by Vconf -m prep SDfile
Find this compound or compounds like it in BindingDB:
Activity Spreadsheet -- Enzyme Inhibition Constant Data from BindingDB
Found 1 hit for monomerid = 50519573
TargetLeukotriene C4 synthase(Homo sapiens (Human))
Orexo
Curated by ChEMBL
LigandPNGBDBM50519573(CHEMBL4456770)
Affinity DataIC50:  16nM. Assay description: Inhibition of human N-terminal His6-tagged LTC4S expressed in Pichia pastoris X33 using LTA4 methyl ester and glutathione as substrate preincubated f...
Ligand InfoPC cidPC sid
In DepthDetails ArticlePubMed