BDBM50521697 CHEMBL4468174
SMILES Oc1ccc(cc1)-n1c2cc(ccc2cc2c1nc(=O)n(-c1ccc(Cl)cc1)c2=O)C#N
InChI Key InChIKey=WPOAASIIQOPIDO-UHFFFAOYSA-N
Data  1 IC50
  Tab Delimited (TSV)   2D SDfile   Computed 3D by Vconf -m prep SDfile
Find this compound or compounds like it in BindingDB:
Activity Spreadsheet -- Enzyme Inhibition Constant Data from BindingDB
Found 1 hit for monomerid = 50521697
TargetTyrosyl-DNA phosphodiesterase 2(Homo sapiens (Human))
National Cancer Institute
Curated by ChEMBL
LigandPNGBDBM50521697(CHEMBL4468174)
Affinity DataIC50:  33nM. Assay description: Inhibition of humanized zebrafish TDP2 using 5'-(6-FAM-NHS) as substrate preincubated for 10 mins followed by substrate addition and measured after 6...
Ligand InfoPC cidPC sid
In DepthDetails ArticlePubMed