BDBM50523585 CHEMBL4577468
SMILES OC(=O)c1ccc(CNc2ccc(cn2)-c2ccc(cn2)-c2nc3cc(Cl)ccc3[nH]2)cc1
InChI Key InChIKey=KMRKVWIQPVPEED-UHFFFAOYSA-N
Data  1 KI  4 IC50
  Tab Delimited (TSV)   2D SDfile   Computed 3D by Vconf -m prep SDfile
Find this compound or compounds like it in BindingDB:
Activity Spreadsheet -- Enzyme Inhibition Constant Data from BindingDB
Found 5 hits for monomerid = 50523585
TargetPotassium voltage-gated channel subfamily H member 2(Homo sapiens (Human))
Merck
Curated by ChEMBL
LigandPNGBDBM50523585(CHEMBL4577468)
Affinity DataKi:  1.19E+4nM. Assay description: Inhibition of human ERG
Ligand InfoPC cidPC sid
In DepthDetails ArticlePubMed
TargetDiacylglycerol O-acyltransferase 1(Homo sapiens (Human))
Merck
Curated by ChEMBL
LigandPNGBDBM50523585(CHEMBL4577468)
Affinity DataIC50:  9.60nM. Assay description: Inhibition of human DGAT1
Ligand InfoPC cidPC sid
In DepthDetails ArticlePubMed
TargetSterol O-acyltransferase 1(Homo sapiens (Human))
Merck
Curated by ChEMBL
LigandPNGBDBM50523585(CHEMBL4577468)
Affinity DataIC50: >1.00E+4nM. Assay description: Inhibition of human ACAT1
Ligand InfoPC cidPC sid
In DepthDetails ArticlePubMed
TargetDiacylglycerol O-acyltransferase 1(Mus musculus (mouse))
Merck
Curated by ChEMBL
LigandPNGBDBM50523585(CHEMBL4577468)
Affinity DataIC50:  84nM. Assay description: Inhibition of mouse DGAT1
Ligand InfoPC cidPC sid
In DepthDetails ArticlePubMed
TargetCytochrome P450 2C8(Homo sapiens (Human))
Merck
Curated by ChEMBL
LigandPNGBDBM50523585(CHEMBL4577468)
Affinity DataIC50:  2.5nM. Assay description: Inhibition of CYP2C8 (unknown origin)
Ligand InfoPC cidPC sid
In DepthDetails ArticlePubMed