BDBM50526684 CHEMBL4437569
SMILES COc1cc(CCNC[C@H](O)COc2ccc(COCCOC(C)C)cc2)ccc1OCCSSCCN
InChI Key InChIKey=XZKSUWKPIXBGCI-VWLOTQADSA-N
Data  2 KI
  Tab Delimited (TSV)   2D SDfile   Computed 3D by Vconf -m prep SDfile
Find this compound or compounds like it in BindingDB:
Activity Spreadsheet -- Enzyme Inhibition Constant Data from BindingDB
Found 2 hits for monomerid = 50526684
TargetBeta-1 adrenergic receptor(Mus musculus)
Friedrich-Alexander Universit£T Erlangen-N£Rnberg
Curated by ChEMBL
LigandPNGBDBM50526684(CHEMBL4437569)
Affinity DataKi:  2.60nM. Assay description: Displacement of [3H]CGP12177 from mouse beta1 adrenoceptor expressed in HEK293T cell membranes
Ligand InfoKEGGPC cidPC sid
In DepthDetails ArticlePubMed
TargetBeta-2 adrenergic receptor(Homo sapiens (Human))
Friedrich-Alexander Universit£T Erlangen-N£Rnberg
Curated by ChEMBL
LigandPNGBDBM50526684(CHEMBL4437569)
Affinity DataKi:  51nM. Assay description: Displacement of [3H]CGP12177 from human beta2 adrenoceptor expressed in CHO cell membranes
Ligand InfoKEGGPC cidPC sid
In DepthDetails ArticlePubMed