BDBM50526750 CHEMBL4468424::US10807974, Example 140::US10995088, Example 140::US11608330, Example 140
SMILES CS(=O)(=O)c1cc(cc(c1)S(=O)(=O)c1cnc(CN)s1)-c1ccc(cc1)C(F)(F)F
InChI Key InChIKey=BBMWLGAGAZHJLT-UHFFFAOYSA-N
Data  4 IC50
  Tab Delimited (TSV)   2D SDfile   Computed 3D by Vconf -m prep SDfile
Find this compound or compounds like it in BindingDB:
Activity Spreadsheet -- Enzyme Inhibition Constant Data from BindingDB
Found 4 hits for monomerid = 50526750
TargetLysyl oxidase homolog 2(Homo sapiens (Human))
University Of Manchester
Curated by ChEMBL
LigandPNGBDBM50526750(CHEMBL4468424 | US10807974, Example 140 | US109950...)
Affinity DataIC50:  174nM. Assay description: Inhibition of human C-terminal His10-tagged LOXL2 (Met1 to Gln774 residues) expressed in mouse NS0 cells using cadaverine hydrochloride as substrate ...
Ligand InfoPC cidPC sid
In DepthDetails ArticlePubMed
TargetLysyl oxidase homolog 2(Homo sapiens (Human))
University Of Manchester
Curated by ChEMBL
LigandPNGBDBM50526750(CHEMBL4468424 | US10807974, Example 140 | US109950...)
Affinity DataIC50:  170nM
Ligand InfoPC cidPC sid
In DepthDetails US Patent
TargetLysyl oxidase homolog 2(Homo sapiens (Human))
University Of Manchester
Curated by ChEMBL
LigandPNGBDBM50526750(CHEMBL4468424 | US10807974, Example 140 | US109950...)
Affinity DataIC50:  170nM. Assay description: 10. Incubate for 1 hr at room temp on a plate shaker, protected from light.
Ligand InfoPC cidPC sid
In DepthDetails US Patent
TargetLysyl oxidase homolog 2(Homo sapiens (Human))
University Of Manchester
Curated by ChEMBL
LigandPNGBDBM50526750(CHEMBL4468424 | US10807974, Example 140 | US109950...)
Affinity DataIC50:  170nM. Assay description: LOXL2 batch is obtained from R&D systems/Bio-techne. Incubate for 1 hour at room temp on a plate shaker.
Ligand InfoPC cidPC sid
In DepthDetails US Patent