BDBM50526893 CHEMBL4586954
SMILES OC(=O)C(F)(F)F.OC(=O)C(F)(F)F.N[C@@H](Cc1ccc(O)cc1)C(=O)N[C@@H]1CSCc2ccccc2CSC[C@@H](NC(=O)[C@@H](N)Cc2ccc(O)cc2)C(=O)NCC(=O)N[C@@H](Cc2ccc(F)cc2)C(=O)NNC(=O)[C@H](Cc2ccc(F)cc2)NC(=O)CNC1=O
InChI Key InChIKey=PYJOZFZUINVNAW-FTMHIQFLSA-N
Data  3 KI  1 IC50  3 EC50
  Tab Delimited (TSV)   2D SDfile   Computed 3D by Vconf -m prep SDfile
Find this compound or compounds like it in BindingDB:
Activity Spreadsheet -- Enzyme Inhibition Constant Data from BindingDB
Found 7 hits for monomerid = 50526893
TargetDelta-type opioid receptor(Homo sapiens (Human))
Universit£
Curated by ChEMBL
LigandPNGBDBM50526893(CHEMBL4586954)
Affinity DataKi:  4.90nM. Assay description: Displacement of [3H]-diprenorphine from human DOR expressed in CHO cell membranes incubated for 1 hr by scintillation counting method
Ligand InfoPC cidPC sid
In DepthDetails ArticlePubMed
TargetMu-type opioid receptor(Homo sapiens (Human))
Universit£
Curated by ChEMBL
LigandPNGBDBM50526893(CHEMBL4586954)
Affinity DataKi:  16nM. Assay description: Displacement of [3H]-diprenorphine from human MOR expressed in CHO cell membranes incubated for 1 hr by scintillation counting method
Ligand InfoPC cidPC sid
In DepthDetails ArticlePubMed
TargetKappa-type opioid receptor(Homo sapiens (Human))
Universit£
Curated by ChEMBL
LigandPNGBDBM50526893(CHEMBL4586954)
Affinity DataKi:  293nM. Assay description: Displacement of [3H]-diprenorphine from human KOR expressed in CHO cell membranes incubated for 1 hr by scintillation counting method
Ligand InfoPC cidPC sid
In DepthDetails ArticlePubMed
TargetMu-type opioid receptor(Homo sapiens (Human))
Universit£
Curated by ChEMBL
LigandPNGBDBM50526893(CHEMBL4586954)
Affinity DataEC50:  7.5nM. Assay description: Agonist activity at human MOR expressed in CHO cell membranes incubated for 1 hr by [35S]-GTPgammaS coupling assay
Ligand InfoPC cidPC sid
In DepthDetails ArticlePubMed
TargetDelta-type opioid receptor(Homo sapiens (Human))
Universit£
Curated by ChEMBL
LigandPNGBDBM50526893(CHEMBL4586954)
Affinity DataEC50:  142nM. Assay description: Agonist activity at human DOR expressed in CHO cell membranes incubated for 1 hr by [35S]-GTPgammaS coupling assay
Ligand InfoPC cidPC sid
In DepthDetails ArticlePubMed
TargetKappa-type opioid receptor(Homo sapiens (Human))
Universit£
Curated by ChEMBL
LigandPNGBDBM50526893(CHEMBL4586954)
Affinity DataEC50:  806nM. Assay description: Agonist activity at human KOR expressed in CHO cell membranes incubated for 1 hr by [35S]-GTPgammaS coupling assay
Ligand InfoPC cidPC sid
In DepthDetails ArticlePubMed
TargetDelta-type opioid receptor(Homo sapiens (Human))
Universit£
Curated by ChEMBL
LigandPNGBDBM50526893(CHEMBL4586954)
Affinity DataIC50:  8.90nM. Assay description: Antagonist activity at human DOR expressed in CHO cell membranes assessed as reduction in SNC80-induced response incubated for 1 hr by [35S]-GTPgamma...
Ligand InfoPC cidPC sid
In DepthDetails ArticlePubMed