BDBM50527312 CHEMBL4445093::US10829446, Compound 120
SMILES CCOc1cccc(c1)C(=O)NNS(=O)(=O)c1ccccc1F
InChI Key InChIKey=UJCWSBXCKAMRCP-UHFFFAOYSA-N
Data  4 IC50
  Tab Delimited (TSV)   2D SDfile   Computed 3D by Vconf -m prep SDfile
Find this compound or compounds like it in BindingDB:
Activity Spreadsheet -- Enzyme Inhibition Constant Data from BindingDB
Found 4 hits for monomerid = 50527312
TargetHistone acetyltransferase KAT6A [507-778](Homo sapiens)
Monash University (Parkville Campus)
Curated by ChEMBL
LigandPNGBDBM50527312(CHEMBL4445093 | US10829446, Compound 120)
Affinity DataIC50:  650nM. Assay description: Inhibition of recombinant KAT6A (unknown origin) expressed in C57BL/6 mouse embryonic fibroblasts assessed as reduction in cell proliferation supplem...
Ligand InfoPC cidPC sid
In DepthDetails ArticlePubMed
TargetHistone acetyltransferase KAT6A [507-778](Homo sapiens)
Monash University (Parkville Campus)
Curated by ChEMBL
LigandPNGBDBM50527312(CHEMBL4445093 | US10829446, Compound 120)
Affinity DataIC50:  126nM. Assay description: Active Moz protein was expressed as N-terminal fusion protein with a His6 tag in BL21 E. coli cells. Protein purification was performed via nickel-im...
Ligand InfoPC cidPC sid
In DepthDetails US Patent
TargetHistone acetyltransferase KAT6A [507-778](Homo sapiens)
Monash University (Parkville Campus)
Curated by ChEMBL
LigandPNGBDBM50527312(CHEMBL4445093 | US10829446, Compound 120)
Affinity DataIC50:  69nM. Assay description: Inhibition of N-terminal NusA-fused His6-tagged human KAT6A (507 to 778 residues) expressed in Escherichia coli BL21 (DE3) cells using 0.4 uM acetyl ...
Ligand InfoPC cidPC sid
In DepthDetails ArticlePubMed
TargetHistone acetyltransferase KAT6A [507-778](Homo sapiens)
Monash University (Parkville Campus)
Curated by ChEMBL
LigandPNGBDBM50527312(CHEMBL4445093 | US10829446, Compound 120)
Affinity DataIC50:  1.10E+3nM. Assay description: Inhibition of N-terminal NusA-fused His6-tagged human KAT6A (507 to 778 residues) expressed in Escherichia coli BL21 (DE3) cells using 15 uM acetyl c...
Ligand InfoPC cidPC sid
In DepthDetails ArticlePubMed