BDBM50527315 CHEMBL4566381::US10829446, Compound 122
SMILES CC(C)c1cccc(c1)C(=O)NNS(=O)(=O)c1ccccc1F
InChI Key InChIKey=DHQAEDZRCQLYSR-UHFFFAOYSA-N
Data  3 IC50
  Tab Delimited (TSV)   2D SDfile   Computed 3D by Vconf -m prep SDfile
Find this compound or compounds like it in BindingDB:
Activity Spreadsheet -- Enzyme Inhibition Constant Data from BindingDB
Found 3 hits for monomerid = 50527315
TargetHistone acetyltransferase KAT6A [507-778](Homo sapiens)
Monash University (Parkville Campus)
Curated by ChEMBL
LigandPNGBDBM50527315(CHEMBL4566381 | US10829446, Compound 122)
Affinity DataIC50:  1.30E+4nM. Assay description: Inhibition of N-terminal NusA-fused His6-tagged human KAT6A (507 to 778 residues) expressed in Escherichia coli BL21 (DE3) cells using 15 uM acetyl c...
Ligand InfoPC cidPC sid
In DepthDetails ArticlePubMed
TargetHistone acetyltransferase KAT6A [507-778](Homo sapiens)
Monash University (Parkville Campus)
Curated by ChEMBL
LigandPNGBDBM50527315(CHEMBL4566381 | US10829446, Compound 122)
Affinity DataIC50:  966nM. Assay description: Active Moz protein was expressed as N-terminal fusion protein with a His6 tag in BL21 E. coli cells. Protein purification was performed via nickel-im...
Ligand InfoPC cidPC sid
In DepthDetails US Patent
TargetHistone acetyltransferase KAT6A [507-778](Homo sapiens)
Monash University (Parkville Campus)
Curated by ChEMBL
LigandPNGBDBM50527315(CHEMBL4566381 | US10829446, Compound 122)
Affinity DataIC50:  970nM. Assay description: Inhibition of N-terminal NusA-fused His6-tagged human KAT6A (507 to 778 residues) expressed in Escherichia coli BL21 (DE3) cells using 0.4 uM acetyl ...
Ligand InfoPC cidPC sid
In DepthDetails ArticlePubMed