BDBM50527780 CHEMBL4437739
SMILES COc1ccc(cc1)-c1cn2cc(ccc2n1)-c1ccc(OC)cc1
InChI Key InChIKey=LSAJHHDEDXZVJP-UHFFFAOYSA-N
Data  1 IC50
  Tab Delimited (TSV)   2D SDfile   Computed 3D by Vconf -m prep SDfile
Find this compound or compounds like it in BindingDB:
Activity Spreadsheet -- Enzyme Inhibition Constant Data from BindingDB
Found 1 hit for monomerid = 50527780
TargetAldehyde dehydrogenase family 1 member A3(Homo sapiens (Human))
University Of Pisa
Curated by ChEMBL
LigandPNGBDBM50527780(CHEMBL4437739)
Affinity DataIC50:  1.14E+4nM. Assay description: Inhibition of recombinant human 6His-tagged ALDH1A3 expressed in Escherichia coli BL21(DE3) using acetaldehyde as substrate preincubated for 5 mins f...
Ligand InfoPC cidPC sid
In DepthDetails ArticlePubMed