BDBM50532351 CHEMBL4565958
SMILES Cc1n[nH]cc1Nc1nccc(n1)-c1ccn([C@H](CO)c2ccc(Cl)c(F)c2)c(=O)c1
InChI Key InChIKey=PFOQAHNUEZPUGA-LJQANCHMSA-N
Data  4 IC50
  Tab Delimited (TSV)   2D SDfile   Computed 3D by Vconf -m prep SDfile
Find this compound or compounds like it in BindingDB:
Activity Spreadsheet -- Enzyme Inhibition Constant Data from BindingDB
Found 4 hits for monomerid = 50532351
TargetMitogen-activated protein kinase 1(Homo sapiens (Human))
Array Biopharma
Curated by ChEMBL
LigandPNGBDBM50532351(CHEMBL4565958)
Affinity DataIC50:  0.900nM. Assay description: Inhibition of ERK2 (unknown origin)
Ligand InfoPC cidPC sid
In DepthDetails ArticlePubMed
TargetMitogen-activated protein kinase 1(Homo sapiens (Human))
Array Biopharma
Curated by ChEMBL
LigandPNGBDBM50532351(CHEMBL4565958)
Affinity DataIC50:  0.900nM. Assay description: Inhibition of ERK2 (unknown origin)
Ligand InfoPC cidPC sid
In DepthDetails ArticlePubMed
TargetMitogen-activated protein kinase 3(Homo sapiens (Human))
Array Biopharma
Curated by ChEMBL
LigandPNGBDBM50532351(CHEMBL4565958)
Affinity DataIC50:  3.80nM. Assay description: Inhibition of ERK1 (unknown origin)
Ligand InfoPC cidPC sid
In DepthDetails ArticlePubMed
TargetMitogen-activated protein kinase 3(Homo sapiens (Human))
Array Biopharma
Curated by ChEMBL
LigandPNGBDBM50532351(CHEMBL4565958)
Affinity DataIC50:  3.80nM. Assay description: Inhibition of ERK1 (unknown origin)
Ligand InfoPC cidPC sid
In DepthDetails ArticlePubMed