BDBM50533424 CHEMBL4574148
SMILES CC(C)Oc1ccc(CN(CCC(N)=O)C(=O)c2cnn(Cc3ccccc3)c2-c2ccc3sccc3c2)cc1
InChI Key InChIKey=YEDMOKVDDMHGJC-UHFFFAOYSA-N
Data  3 IC50
PDB links: 1 PDB ID matches this monomer.
  Tab Delimited (TSV)   2D SDfile   Computed 3D by Vconf -m prep SDfile
Find this compound or compounds like it in BindingDB:
Activity Spreadsheet -- Enzyme Inhibition Constant Data from BindingDB
Found 3 hits for monomerid = 50533424
TargetDitrans,polycis-undecaprenyl-diphosphate synthase ((2E,6E)-farnesyl-diphosphate specific)(Pseudomonas aeruginosa (strain ATCC 15692 / DSM 22...)
Glaxosmithkline
Curated by ChEMBL
LigandPNGBDBM50533424(CHEMBL4574148)
Affinity DataIC50: >1.00E+5nM. Assay description: Inhibition of hexa-histidine tagged Pseudomonas aeruginosa UppS expressed in Escherichia coli assessed as reduction in IPP condensation to growing pr...
Ligand InfoPC cidPC sidPDB
In DepthDetails ArticlePubMed
LigandPNGBDBM50533424(CHEMBL4574148)
Affinity DataIC50: >1.00E+5nM. Assay description: Inhibition of hexa-histidine tagged Klebsiella pneumoniae UppS expressed in Escherichia coli assessed as reduction in IPP condensation to growing pre...
Ligand InfoPC cidPC sidPDB
In DepthDetails ArticlePubMed
LigandPNGBDBM50533424(CHEMBL4574148)
Affinity DataIC50: >1.00E+5nM. Assay description: Inhibition of hexa-histidine tagged Acinetobacter baumannii UppS expressed in Escherichia coli assessed as reduction in IPP condensation to growing p...
Ligand InfoPC cidPC sidPDB
In DepthDetails ArticlePubMed