BDBM50534485 CHEMBL4435655
SMILES CCCCCn1cc(C(=O)c2cccc3ccccc23)c2ccc(F)cc12
InChI Key InChIKey=JBIOFRITBMPVGQ-UHFFFAOYSA-N
Data  2 KI
  Tab Delimited (TSV)   2D SDfile   Computed 3D by Vconf -m prep SDfile
Find this compound or compounds like it in BindingDB:
Activity Spreadsheet -- Enzyme Inhibition Constant Data from BindingDB
Found 2 hits for monomerid = 50534485
TargetCannabinoid receptor 1(Homo sapiens (Human))
Research Triangle Institute
Curated by ChEMBL
LigandPNGBDBM50534485(CHEMBL4435655)
Affinity DataKi:  2.40nM. Assay description: Displacement of [3H]-CP55940 from human CB1 receptor
Ligand InfoPC cidPC sid
In DepthDetails ArticlePubMed
TargetCannabinoid receptor 2(Homo sapiens (Human))
Research Triangle Institute
Curated by ChEMBL
LigandPNGBDBM50534485(CHEMBL4435655)
Affinity DataKi:  16nM. Assay description: Displacement of [3H]-CP55940 from human CB2 receptor
Ligand InfoPC cidPC sid
In DepthDetails ArticlePubMed