BDBM50535511 CHEMBL4447270
SMILES CN(C)c1cncc(NC(=O)[C@@H]2CCCNN2C(=O)[C@H](CC2CCCC2)CN(O)C=O)n1
InChI Key InChIKey=RQHWJSZECVLRTL-SJORKVTESA-N
Data  1 IC50
  Tab Delimited (TSV)   2D SDfile   Computed 3D by Vconf -m prep SDfile
Find this compound or compounds like it in BindingDB:
Activity Spreadsheet -- Enzyme Inhibition Constant Data from BindingDB
Found 1 hit for monomerid = 50535511
TargetPeptide deformylase(Staphylococcus aureus)
Glaxosmithkline
Curated by ChEMBL
LigandPNGBDBM50535511(CHEMBL4447270)
Affinity DataIC50:  5nM. Assay description: Inhibition of Staphylococcus aureus PDF by fluorescence detection assay
Ligand InfoPC cidPC sid
In DepthDetails ArticlePubMed