BDBM50542256 CHEMBL4648027
SMILES Clc1cc(Cl)c2nn(CCCCN3CCN(CC3)c3cccc4sccc34)c(=O)n2c1
InChI Key InChIKey=AQIVLQPOLXWQOZ-UHFFFAOYSA-N
Data  2 IC50  1 EC50
  Tab Delimited (TSV)   2D SDfile   Computed 3D by Vconf -m prep SDfile
Find this compound or compounds like it in BindingDB:
Activity Spreadsheet -- Enzyme Inhibition Constant Data from BindingDB
Found 3 hits for monomerid = 50542256
TargetD(2) dopamine receptor(Homo sapiens (Human))
University Of Chinese Academy Of Sciences
Curated by ChEMBL
LigandPNGBDBM50542256(CHEMBL4648027)
Affinity DataIC50:  406nM. Assay description: Antagonist activity at D2 receptor (unknown origin) by HTRF cAMP assay
Ligand InfoPC cidPC sid
In DepthDetails ArticlePubMed
Target5-hydroxytryptamine receptor 2A(Homo sapiens (Human))
University Of Chinese Academy Of Sciences
Curated by ChEMBL
LigandPNGBDBM50542256(CHEMBL4648027)
Affinity DataIC50:  652nM. Assay description: Antagonist activity at 5HT2A receptor (unknown origin) by HTRF cAMP assay
Ligand InfoPC cidPC sid
In DepthDetails ArticlePubMed
Target5-hydroxytryptamine receptor 1A(Homo sapiens (Human))
University Of Chinese Academy Of Sciences
Curated by ChEMBL
LigandPNGBDBM50542256(CHEMBL4648027)
Affinity DataEC50:  0.100nM. Assay description: Agonist activity at 5HT1A receptor (unknown origin) by calcium-dye based FLIPR assay
Ligand InfoPC cidPC sid
In DepthDetails ArticlePubMed