BDBM50649 2-nitro-4-[(6-nitro-4-quinolinyl)amino]-N-[4-(pyridin-4-ylamino)phenyl]benzamide::2-nitro-4-[(6-nitro-4-quinolyl)amino]-N-[4-(4-pyridylamino)phenyl]benzamide::2-nitro-4-[(6-nitroquinolin-4-yl)amino]-N-[4-(pyridin-4-ylamino)phenyl]benzamide::MLS000756458::SMR000528741::cid_5236119
SMILES [O-][N+](=O)c1ccc2nccc(Nc3ccc(C(=O)Nc4ccc(Nc5ccncc5)cc4)c(c3)[N+]([O-])=O)c2c1
InChI Key InChIKey=YUOOWNPVFAMPNZ-UHFFFAOYSA-N
Data  3 IC50
  Tab Delimited (TSV)   2D SDfile   Computed 3D by Vconf -m prep SDfile
Find this compound or compounds like it in BindingDB:
Activity Spreadsheet -- Enzyme Inhibition Constant Data from BindingDB
Found 3 hits for monomerid = 50649
TargetInduced myeloid leukemia cell differentiation protein Mcl-1(Homo sapiens (Human))
Emory University
Curated by PubChem BioAssay
LigandPNGBDBM50649(2-nitro-4-[(6-nitro-4-quinolinyl)amino]-N-[4-(pyri...)
Affinity DataIC50:  2.46E+3nM. Assay description: NIH Molecular Libraries Screening Centers Network [MLSCN] Emory Chemical Biology Discovery Center in MLSCN Assay provider: Nikolovska-Coleska, Univer...
In DepthDetails PCBioAssay
TargetMajor prion protein(Homo sapiens (Human))
The Scripps Research Institute Molecular Screening Center
Curated by PubChem BioAssay
LigandPNGBDBM50649(2-nitro-4-[(6-nitro-4-quinolinyl)amino]-N-[4-(pyri...)
Affinity DataIC50:  9.03E+3nM. Assay description: Source (MLPCN Center Name): The Scripps Research Institute Molecular Screening Center (SRIMSC) Affiliation: The Scripps Research Institute, TSRI Assa...
In DepthDetails PCBioAssay
TargetNeutrophil cytosol factor 1 [S99G](Homo sapiens (Human))
Emory University
Curated by PubChem BioAssay
LigandPNGBDBM50649(2-nitro-4-[(6-nitro-4-quinolinyl)amino]-N-[4-(pyri...)
Affinity DataIC50:  3.59E+3nM. Assay description: NIH Molecular Libraries Screening Centers Network [MLSCN] Emory Chemical Biology Discovery Center in MLSCN Assay provider: Susan Smith, Emory Univers...
In DepthDetails PCBioAssay