BDBM50675 2-(2-furanylmethyl)-3-sulfanylidene-4,6,7,8-tetrahydrocyclopenta[2,3]thieno[2,4-b]pyrimidin-1-one::2-(2-furfuryl)-3-thioxo-4,6,7,8-tetrahydrocyclopenta[2,3]thieno[2,4-b]pyrimidin-1-one::2-(furan-2-ylmethyl)-3-sulfanylidene-4,6,7,8-tetrahydrocyclopenta[2,3]thieno[2,4-b]pyrimidin-1-one::MLS001018936::SMR000385434::cid_2081076
SMILES O=c1n(Cc2ccco2)c(=S)[nH]c2sc3CCCc3c12
InChI Key InChIKey=QCZYEDSQWTTXCA-UHFFFAOYSA-N
Data  3 IC50
  Tab Delimited (TSV)   2D SDfile   Computed 3D by Vconf -m prep SDfile
Find this compound or compounds like it in BindingDB:
Activity Spreadsheet -- Enzyme Inhibition Constant Data from BindingDB
Found 3 hits for monomerid = 50675
TargetInduced myeloid leukemia cell differentiation protein Mcl-1(Homo sapiens (Human))
Emory University
Curated by PubChem BioAssay
LigandPNGBDBM50675(2-(2-furanylmethyl)-3-sulfanylidene-4,6,7,8-tetrah...)
Affinity DataIC50:  2.10E+3nM. Assay description: NIH Molecular Libraries Screening Centers Network [MLSCN] Emory Chemical Biology Discovery Center in MLSCN Assay provider: Nikolovska-Coleska, Univer...
In DepthDetails PCBioAssay
TargetBcl-2-like protein 1(Homo sapiens (Human))
The Scripps Research Institute Molecular Screening Center
Curated by PubChem BioAssay
LigandPNGBDBM50675(2-(2-furanylmethyl)-3-sulfanylidene-4,6,7,8-tetrah...)
Affinity DataIC50:  1.09E+5nM. Assay description: Source (MLPCN Center Name): The Scripps Research Institute Molecular Screening Center Affiliation: The Scripps Research Institute, TSRI Assay Provide...
In DepthDetails PCBioAssay
TargetInduced myeloid leukemia cell differentiation protein Mcl-1(Homo sapiens (Human))
Emory University
Curated by PubChem BioAssay
LigandPNGBDBM50675(2-(2-furanylmethyl)-3-sulfanylidene-4,6,7,8-tetrah...)
Affinity DataIC50:  7.78E+4nM. Assay description: Source (MLPCN Center Name): The Scripps Research Institute Molecular Screening Center Affiliation: The Scripps Research Institute, TSRI Assay Provide...
In DepthDetails PCBioAssay