BDBM51077 (5Z)-4-(4-chloroanilino)-5-(2-furanylmethylidene)-2-thiazolone::(5Z)-4-(4-chloroanilino)-5-(2-furfurylidene)-3-thiazolin-2-one::(5Z)-4-(4-chloroanilino)-5-(furan-2-ylmethylidene)-1,3-thiazol-2-one::(5Z)-4-[(4-chlorophenyl)amino]-5-(furan-2-ylmethylidene)-1,3-thiazol-2-one::MLS000724782::SMR000236935::cid_2146880
SMILES Clc1ccc(NC2=NC(=O)SC2=Cc2ccco2)cc1
InChI Key InChIKey=ZWSPHOGMDVRJAJ-UHFFFAOYSA-N
Data  2 IC50
  Tab Delimited (TSV)   2D SDfile   Computed 3D by Vconf -m prep SDfile
Find this compound or compounds like it in BindingDB:
Activity Spreadsheet -- Enzyme Inhibition Constant Data from BindingDB
Found 2 hits for monomerid = 51077
TargetCarboxy-terminal domain RNA polymerase II polypeptide A small phosphatase 1(Homo sapiens (Human))
Burnham Center For Chemical Genomics
Curated by PubChem BioAssay
LigandPNGBDBM51077((5Z)-4-(4-chloroanilino)-5-(2-furanylmethylidene)-...)
Affinity DataIC50:  1.86E+3nM. Assay description: Data Source: Sanford-Burnham Center for Chemical Genomics (SBCCG) Source Affiliation: Sanford-Burnham Medical Research Institute (SBMRI, San Diego, C...
In DepthDetails PCBioAssay
TargetGlycoprotein 42(Human herpesvirus 4 type 2)
Emory University
Curated by PubChem BioAssay
LigandPNGBDBM51077((5Z)-4-(4-chloroanilino)-5-(2-furanylmethylidene)-...)
Affinity DataIC50:  2.68E+3nM. Assay description: NIH Molecular Libraries Screening Centers Network [MLSCN] Emory Chemical Biology Discovery Center in MLSCN Assay provider: Theodore Jardetzky; Northw...
In DepthDetails PCBioAssay