BDBM51355 2-[(4-fluorobenzyl)thio]-N-(4-methylbenzyl)acetamide::2-[(4-fluorophenyl)methylsulfanyl]-N-[(4-methylphenyl)methyl]acetamide::2-[(4-fluorophenyl)methylsulfanyl]-N-[(4-methylphenyl)methyl]ethanamide::2-[(4-fluorophenyl)methylthio]-N-[(4-methylphenyl)methyl]acetamide::MLS000685249::SMR000311487::cid_3324372
SMILES Cc1ccc(CNC(=O)CSCc2ccc(F)cc2)cc1
InChI Key InChIKey=NBFPLGDWVCGPKN-UHFFFAOYSA-N
Data  1 IC50
  Tab Delimited (TSV)   2D SDfile   Computed 3D by Vconf -m prep SDfile
Find this compound or compounds like it in BindingDB:
Activity Spreadsheet -- Enzyme Inhibition Constant Data from BindingDB
Found 1 hit for monomerid = 51355
TargetDNA repair protein RAD51 homolog 1(Homo sapiens (Human))
Pcmd
Curated by PubChem BioAssay
LigandPNGBDBM51355(2-[(4-fluorobenzyl)thio]-N-(4-methylbenzyl)acetami...)
Affinity DataIC50:  5.30E+4nM. Assay description: Project Title: A screen for modulators of human Rad51, a key DNA repair protein Application Number: MH084119 Assay Submitter: Dr. Alex Mazin Submitte...
In DepthDetails PCBioAssay