BDBM51389 3-(1-azepanylsulfonyl)benzoic acid [2-(carbamoylamino)-2-oxoethyl] ester::3-(azepan-1-ylsulfonyl)benzoic acid (2-keto-2-ureido-ethyl) ester::MLS000761232::SMR000369537::[2-(aminocarbonylamino)-2-oxidanylidene-ethyl] 3-(azepan-1-ylsulfonyl)benzoate::[2-(carbamoylamino)-2-oxoethyl] 3-(azepan-1-ylsulfonyl)benzoate::cid_2119586
SMILES NC(=O)NC(=O)COC(=O)c1cccc(c1)S(=O)(=O)N1CCCCCC1
InChI Key InChIKey=HEBDUYJRJWBVLC-UHFFFAOYSA-N
Data  1 IC50
  Tab Delimited (TSV)   2D SDfile   Computed 3D by Vconf -m prep SDfile
Find this compound or compounds like it in BindingDB:
Activity Spreadsheet -- Enzyme Inhibition Constant Data from BindingDB
Found 1 hit for monomerid = 51389
TargetDNA repair protein RAD51 homolog 1(Homo sapiens (Human))
Pcmd
Curated by PubChem BioAssay
LigandPNGBDBM51389(3-(1-azepanylsulfonyl)benzoic acid [2-(carbamoylam...)
Affinity DataIC50:  5.30E+4nM. Assay description: Project Title: A screen for modulators of human Rad51, a key DNA repair protein Application Number: MH084119 Assay Submitter: Dr. Alex Mazin Submitte...
In DepthDetails PCBioAssay