BDBM51403 6-(2,5-dioxo-1-pyrrolidinyl)-N-(1H-1,2,4-triazol-5-yl)hexanamide::6-(2,5-dioxopyrrolidin-1-yl)-N-(1H-1,2,4-triazol-5-yl)hexanamide::6-[2,5-bis(oxidanylidene)pyrrolidin-1-yl]-N-(1H-1,2,4-triazol-5-yl)hexanamide::6-succinimido-N-(1H-1,2,4-triazol-5-yl)hexanamide::MLS-0027262.0001::cid_2219853
SMILES O=C(CCCCCN1C(=O)CCC1=O)Nc1nnc[nH]1
InChI Key InChIKey=OIHQWVRAZROKJO-UHFFFAOYSA-N
Data  1 EC50
  Tab Delimited (TSV)   2D SDfile   Computed 3D by Vconf -m prep SDfile
Find this compound or compounds like it in BindingDB:
Activity Spreadsheet -- Enzyme Inhibition Constant Data from BindingDB
Found 1 hit for monomerid = 51403
TargetAlkaline phosphatase, tissue-nonspecific isozyme(Homo sapiens (Human))
Burnham Center For Chemical Genomics
Curated by PubChem BioAssay
LigandPNGBDBM51403(6-(2,5-dioxo-1-pyrrolidinyl)-N-(1H-1,2,4-triazol-5...)
Affinity DataEC50:  1.95E+4nM. Assay description: Data Source: Sanford-Burnham Center for Chemical Genomics (SBCCG) Source Affiliation: Sanford-Burnham Medical Research Institute (SBMRI, San Diego, C...
In DepthDetails PCBioAssay