BDBM51406 3-[methyl(phenyl)sulfamoyl]-N-(1H-1,2,4-triazol-5-yl)benzamide::MLS-0310026.0001::cid_2354992
SMILES CN(c1ccccc1)S(=O)(=O)c1cccc(c1)C(=O)Nc1nnc[nH]1
InChI Key InChIKey=SXZCTIHROQZGBR-UHFFFAOYSA-N
Data  1 EC50
  Tab Delimited (TSV)   2D SDfile   Computed 3D by Vconf -m prep SDfile
Find this compound or compounds like it in BindingDB:
Activity Spreadsheet -- Enzyme Inhibition Constant Data from BindingDB
Found 1 hit for monomerid = 51406
TargetAlkaline phosphatase, tissue-nonspecific isozyme(Homo sapiens (Human))
Burnham Center For Chemical Genomics
Curated by PubChem BioAssay
LigandPNGBDBM51406(3-[methyl(phenyl)sulfamoyl]-N-(1H-1,2,4-triazol-5-...)
Affinity DataEC50:  5.59E+3nM. Assay description: Data Source: Sanford-Burnham Center for Chemical Genomics (SBCCG) Source Affiliation: Sanford-Burnham Medical Research Institute (SBMRI, San Diego, C...
In DepthDetails PCBioAssay