BDBM51495 6-chloranyl-4-methyl-7-oxidanyl-8-(piperidin-1-ylmethyl)chromen-2-one::6-chloro-7-hydroxy-4-methyl-8-(1-piperidinylmethyl)-1-benzopyran-2-one::6-chloro-7-hydroxy-4-methyl-8-(piperidin-1-ylmethyl)chromen-2-one::6-chloro-7-hydroxy-4-methyl-8-(piperidinomethyl)coumarin::MLS000036893::SMR000037570::cid_5389392
SMILES Cc1cc(=O)oc2c(CN3CCCCC3)c(O)c(Cl)cc12
InChI Key InChIKey=KTTAQVUVZWEFEQ-UHFFFAOYSA-N
Data  2 IC50
  Tab Delimited (TSV)   2D SDfile   Computed 3D by Vconf -m prep SDfile
Find this compound or compounds like it in BindingDB:
Activity Spreadsheet -- Enzyme Inhibition Constant Data from BindingDB
Found 2 hits for monomerid = 51495
TargetM1 family aminopeptidase(Plasmodium falciparum (isolate FcB1 / Columbia))
Srmlsc
Curated by PubChem BioAssay
LigandPNGBDBM51495(6-chloranyl-4-methyl-7-oxidanyl-8-(piperidin-1-ylm...)
Affinity DataIC50:  5.96E+4nM. Assay description: Southern Research Molecular Libraries Screening Center (SRMLSC) Southern Research Institute (Birmingham, Alabama) NIH Molecular Libraries Screening...
In DepthDetails PCBioAssay
TargetdTDP-4-dehydrorhamnose 3,5-epimerase(Mycobacterium tuberculosis H37Rv)
Pcmd
Curated by PubChem BioAssay
LigandPNGBDBM51495(6-chloranyl-4-methyl-7-oxidanyl-8-(piperidin-1-ylm...)
Affinity DataIC50:  544nM. Assay description: Molecular Library Screening Center Network (MLSCN) Penn Center for Molecular Discovery (PCMD) Assay Provider: Michael McNeil, Colorado State Universi...
In DepthDetails PCBioAssay