BDBM51674 4-Butyl-6-chloro-8-diethylaminomethyl-7-hydroxy-chromen-2-one::4-butyl-6-chloranyl-8-(diethylaminomethyl)-7-oxidanyl-chromen-2-one::4-butyl-6-chloro-8-(diethylaminomethyl)-7-hydroxy-1-benzopyran-2-one::4-butyl-6-chloro-8-(diethylaminomethyl)-7-hydroxy-coumarin::4-butyl-6-chloro-8-(diethylaminomethyl)-7-hydroxychromen-2-one::MLS000551591::SMR000145516::cid_5541651
SMILES CCCCc1cc(=O)oc2c(CN(CC)CC)c(O)c(Cl)cc12
InChI Key InChIKey=UHNOHCDBXDQTMX-UHFFFAOYSA-N
Data  2 IC50
  Tab Delimited (TSV)   2D SDfile   Computed 3D by Vconf -m prep SDfile
Find this compound or compounds like it in BindingDB:
Activity Spreadsheet -- Enzyme Inhibition Constant Data from BindingDB
Found 2 hits for monomerid = 51674
TargetM1 family aminopeptidase(Plasmodium falciparum (isolate FcB1 / Columbia))
Srmlsc
Curated by PubChem BioAssay
LigandPNGBDBM51674(4-Butyl-6-chloro-8-diethylaminomethyl-7-hydroxy-ch...)
Affinity DataIC50:  4.16E+4nM. Assay description: Southern Research Molecular Libraries Screening Center (SRMLSC) Southern Research Institute (Birmingham, Alabama) NIH Molecular Libraries Screening...
In DepthDetails PCBioAssay
TargetdTDP-4-dehydrorhamnose 3,5-epimerase(Mycobacterium tuberculosis H37Rv)
Pcmd
Curated by PubChem BioAssay
LigandPNGBDBM51674(4-Butyl-6-chloro-8-diethylaminomethyl-7-hydroxy-ch...)
Affinity DataIC50:  563nM. Assay description: Molecular Library Screening Center Network (MLSCN) Penn Center for Molecular Discovery (PCMD) Assay Provider: Michael McNeil, Colorado State Universi...
In DepthDetails PCBioAssay