BDBM51760 5-[2-(4-methoxyphenyl)-3-[2-(4-methoxyphenyl)ethynyl]-1-benzofuran-5-yl]-1,3-benzodioxole::5-[2-(4-methoxyphenyl)-3-[2-(4-methoxyphenyl)ethynyl]-5-benzofuranyl]-1,3-benzodioxole::5-[2-(4-methoxyphenyl)-3-[2-(4-methoxyphenyl)ethynyl]benzofuran-5-yl]-1,3-benzodioxole::MLS001144022::SMR000526344::cid_24747925
SMILES COc1ccc(cc1)C#Cc1c(oc2ccc(cc12)-c1ccc2OCOc2c1)-c1ccc(OC)cc1
InChI Key InChIKey=ANZKJVMMGHISMC-UHFFFAOYSA-N
Data  1 IC50
  Tab Delimited (TSV)   2D SDfile   Computed 3D by Vconf -m prep SDfile
Find this compound or compounds like it in BindingDB:
Activity Spreadsheet -- Enzyme Inhibition Constant Data from BindingDB
Found 1 hit for monomerid = 51760
TargetdTDP-4-dehydrorhamnose 3,5-epimerase(Mycobacterium tuberculosis H37Rv)
Pcmd
Curated by PubChem BioAssay
LigandPNGBDBM51760(5-[2-(4-methoxyphenyl)-3-[2-(4-methoxyphenyl)ethyn...)
Affinity DataIC50:  785nM. Assay description: Molecular Library Screening Center Network (MLSCN) Penn Center for Molecular Discovery (PCMD) Assay Provider: Michael McNeil, Colorado State Universi...
In DepthDetails PCBioAssay