BDBM51800 4-(1H-indol-3-yl)-N-methyl-1,3-thiazol-2-amine::4-(1H-indol-3-yl)-N-methyl-2-thiazolamine::MLS000554792::SMR000146909::[4-(1H-Indol-3-yl)-thiazol-2-yl]-methyl-amine::[4-(1H-indol-3-yl)thiazol-2-yl]-methyl-amine::cid_912884
SMILES CNc1nc(cs1)-c1c[nH]c2ccccc12
InChI Key InChIKey=LUDSCLCPTPEDMN-UHFFFAOYSA-N
Data  1 IC50  4 EC50
  Tab Delimited (TSV)   2D SDfile   Computed 3D by Vconf -m prep SDfile
Find this compound or compounds like it in BindingDB:
Activity Spreadsheet -- Enzyme Inhibition Constant Data from BindingDB
Found 5 hits for monomerid = 51800
LigandPNGBDBM51800(4-(1H-indol-3-yl)-N-methyl-1,3-thiazol-2-amine | 4...)
Affinity DataEC50:  3.00E+4nM. Assay description: University of New Mexico Assay Overview: Assay Support: 1R03MH084830-01 Project Title: TR-FRET HTS Assay for Inhibitors of MEKK2-MEK5 PB1 Domain...
In DepthDetails PCBioAssay
LigandPNGBDBM51800(4-(1H-indol-3-yl)-N-methyl-1,3-thiazol-2-amine | 4...)
Affinity DataEC50:  3.00E+4nM. Assay description: University of New Mexico Assay Overview: Assay Support: 1R03MH084830-01 Project Title: TR-FRET HTS Assay for Inhibitors of MEKK2-MEK5 PB1 Domain...
In DepthDetails PCBioAssay
TargetProtein artemis(Homo sapiens (Human))
Burnham Center For Chemical Genomics
Curated by PubChem BioAssay
LigandPNGBDBM51800(4-(1H-indol-3-yl)-N-methyl-1,3-thiazol-2-amine | 4...)
Affinity DataIC50:  2.00E+4nM. Assay description: Data Source: Sanford-Burnham Center for Chemical Genomics (SBCCG) Source Affiliation: Sanford-Burnham Medical Research Institute (SBMRI, San Diego CA...
In DepthDetails PCBioAssay
TargetXylosyl- and glucuronyltransferase LARGE1(Homo sapiens (Human))
Burnham Center For Chemical Genomics
Curated by PubChem BioAssay
LigandPNGBDBM51800(4-(1H-indol-3-yl)-N-methyl-1,3-thiazol-2-amine | 4...)
Affinity DataEC50:  4.99E+3nM
In DepthDetails PCBioAssay
TargetXylosyl- and glucuronyltransferase LARGE1(Homo sapiens (Human))
Burnham Center For Chemical Genomics
Curated by PubChem BioAssay
LigandPNGBDBM51800(4-(1H-indol-3-yl)-N-methyl-1,3-thiazol-2-amine | 4...)
Affinity DataEC50:  1.03E+4nM
In DepthDetails PCBioAssay