BDBM51841 MLS000709291::N-[1-(4-hexoxy-3-nitro-phenyl)ethylideneamino]-4,5-dihydro-1H-imidazol-2-amine::N-[1-(4-hexoxy-3-nitrophenyl)ethylideneamino]-4,5-dihydro-1H-imidazol-2-amine::SMR000289958::[1-(4-hexoxy-3-nitro-phenyl)ethylideneamino]-(2-imidazolin-2-yl)amine::cid_3098372
SMILES CCCCCCOc1ccc(cc1[N+]([O-])=O)[C+](C)[N-]NC1=[NH+]CC[N-]1
InChI Key InChIKey=VVUZRZLDRDNOCJ-UHFFFAOYSA-O
Data  6 IC50  4 EC50
  Tab Delimited (TSV)   2D SDfile   Computed 3D by Vconf -m prep SDfile
Find this compound or compounds like it in BindingDB:
Activity Spreadsheet -- Enzyme Inhibition Constant Data from BindingDB
Found 10 hits for monomerid = 51841
LigandPNGBDBM51841(MLS000709291 | N-[1-(4-hexoxy-3-nitro-phenyl)ethyl...)
Affinity DataEC50:  1.44E+4nM. Assay description: University of New Mexico Assay Overview: Assay Support: 1R03MH084830-01 Project Title: TR-FRET HTS Assay for Inhibitors of MEKK2-MEK5 PB1 Domain...
In DepthDetails PCBioAssay
LigandPNGBDBM51841(MLS000709291 | N-[1-(4-hexoxy-3-nitro-phenyl)ethyl...)
Affinity DataEC50:  9.29E+3nM. Assay description: University of New Mexico Assay Overview: Assay Support: 1R03MH084830-01 Project Title: TR-FRET HTS Assay for Inhibitors of MEKK2-MEK5 PB1 Domain...
In DepthDetails PCBioAssay
TargetNeutrophil cytosol factor 1 [S99G](Homo sapiens (Human))
Emory University
Curated by PubChem BioAssay
LigandPNGBDBM51841(MLS000709291 | N-[1-(4-hexoxy-3-nitro-phenyl)ethyl...)
Affinity DataIC50:  2.35E+4nM. Assay description: NIH Molecular Libraries Screening Centers Network [MLSCN] Emory Chemical Biology Discovery Center in MLSCN Assay provider: Susan Smith, Emory Univers...
In DepthDetails PCBioAssay
TargetHeat shock factor protein 1(Mus musculus)
Broad Institute
Curated by PubChem BioAssay
LigandPNGBDBM51841(MLS000709291 | N-[1-(4-hexoxy-3-nitro-phenyl)ethyl...)
Affinity DataEC50: >2.60E+5nM. Assay description: Keywords: Heat Shock Factor-1 (HSF-1), Stress Response, MG132, NIH3T3, Luminescence Assay Overview: Confirmation testing of small molecules identifie...
In DepthDetails PCBioAssay
TargetApoptotic protease-activating factor 1(Homo sapiens (Human))
Burnham Center For Chemical Genomics
Curated by PubChem BioAssay
LigandPNGBDBM51841(MLS000709291 | N-[1-(4-hexoxy-3-nitro-phenyl)ethyl...)
Affinity DataIC50: >1.00E+5nM. Assay description: Data Source: Sanford-Burnham Center for Chemical Genomics (SBCCG) Source Affiliation: Sanford-Burnham Medical Research Institute (SBIMR, San Diego, C...
In DepthDetails PCBioAssay
TargetNeurotensin receptor type 1(Homo sapiens (Human))
Burnham Center For Chemical Genomics
Curated by PubChem BioAssay
LigandPNGBDBM51841(MLS000709291 | N-[1-(4-hexoxy-3-nitro-phenyl)ethyl...)
Affinity DataEC50:  1.89E+4nM. Assay description: Data Source: Sanford-Burnham Center for Chemical Genomics (SBCCG) Source Affiliation: Sanford-Burnham Medical Research Institute (SBMRI, San Diego, C...
In DepthDetails PCBioAssay
TargetBcl-2-related protein A1(Mus musculus (Mouse))
Burnham Center For Chemical Genomics
Curated by PubChem BioAssay
LigandPNGBDBM51841(MLS000709291 | N-[1-(4-hexoxy-3-nitro-phenyl)ethyl...)
Affinity DataIC50: >2.00E+4nM. Assay description: Data Source: Sanford-Burnham Center for Chemical Genomics (SBCCG) Source Affiliation: Sanford-Burnham Medical Research Institute (SBMRI, San Diego CA...
In DepthDetails PCBioAssay
TargetUbiquitin-conjugating enzyme E2 N(Homo sapiens (Human))
Burnham Center For Chemical Genomics
Curated by PubChem BioAssay
LigandPNGBDBM51841(MLS000709291 | N-[1-(4-hexoxy-3-nitro-phenyl)ethyl...)
Affinity DataIC50:  1.21E+4nM. Assay description: Data Source: Sanford-Burnham Center for Chemical Genomics (SBCCG) Source Affiliation: Sanford-Burnham Medical Research Institute (SBMRI, San Diego CA...
In DepthDetails PCBioAssay
TargetApoptotic protease-activating factor 1(Homo sapiens (Human))
Burnham Center For Chemical Genomics
Curated by PubChem BioAssay
LigandPNGBDBM51841(MLS000709291 | N-[1-(4-hexoxy-3-nitro-phenyl)ethyl...)
Affinity DataIC50:  7.05E+4nM. Assay description: Data Source: Sanford-Burnham Center for Chemical Genomics (SBCCG) Source Affiliation: Sanford-Burnham Medical Research Institute (SBIMR, San Diego, C...
In DepthDetails PCBioAssay
TargetUbiquitin-conjugating enzyme E2 N(Homo sapiens (Human))
Burnham Center For Chemical Genomics
Curated by PubChem BioAssay
LigandPNGBDBM51841(MLS000709291 | N-[1-(4-hexoxy-3-nitro-phenyl)ethyl...)
Affinity DataIC50:  1.26E+4nM. Assay description: Data Source: Sanford-Burnham Center for Chemical Genomics (SBCCG) Source Affiliation: Sanford-Burnham Medical Research Institute (SBMRI, San Diego CA...
In DepthDetails PCBioAssay