BDBM51850 7-(4-{[(4-bromobenzoyl)amino]carbonothioyl}piperazin-1-yl)-1-ethyl-6-fluoro-4-oxo-1,4-dihydroquinoline-3-carboxylic acid::7-[4-[(4-bromobenzoyl)carbamothioyl]piperazin-1-yl]-1-ethyl-6-fluoro-4-oxoquinoline-3-carboxylic acid::7-[4-[(4-bromobenzoyl)thiocarbamoyl]piperazino]-1-ethyl-6-fluoro-4-keto-quinoline-3-carboxylic acid::7-[4-[(4-bromophenyl)carbonylcarbamothioyl]piperazin-1-yl]-1-ethyl-6-fluoranyl-4-oxidanylidene-quinoline-3-carboxylic acid::7-[4-[[[(4-bromophenyl)-oxomethyl]amino]-sulfanylidenemethyl]-1-piperazinyl]-1-ethyl-6-fluoro-4-oxo-3-quinolinecarboxylic acid::MLS000682994::SMR000313077::cid_3875592
SMILES CCn1cc(C(O)=O)c(=O)c2cc(F)c(cc12)N1CCN(CC1)C(=S)NC(=O)c1ccc(Br)cc1
InChI Key InChIKey=GSFVYQNRFITLTB-UHFFFAOYSA-N
Data  2 IC50  2 EC50
  Tab Delimited (TSV)   2D SDfile   Computed 3D by Vconf -m prep SDfile
Find this compound or compounds like it in BindingDB:
Activity Spreadsheet -- Enzyme Inhibition Constant Data from BindingDB
Found 4 hits for monomerid = 51850
LigandPNGBDBM51850(7-(4-{[(4-bromobenzoyl)amino]carbonothioyl}piperaz...)
Affinity DataEC50:  3.00E+4nM. Assay description: University of New Mexico Assay Overview: Assay Support: 1R03MH084830-01 Project Title: TR-FRET HTS Assay for Inhibitors of MEKK2-MEK5 PB1 Domain...
In DepthDetails PCBioAssay
TargetLow molecular weight phosphotyrosine protein phosphatase(Homo sapiens (Human))
Burnham Center For Chemical Genomics
Curated by PubChem BioAssay
LigandPNGBDBM51850(7-(4-{[(4-bromobenzoyl)amino]carbonothioyl}piperaz...)
Affinity DataIC50: >8.00E+4nM
In DepthDetails PCBioAssay
TargetLow molecular weight phosphotyrosine protein phosphatase(Homo sapiens (Human))
Burnham Center For Chemical Genomics
Curated by PubChem BioAssay
LigandPNGBDBM51850(7-(4-{[(4-bromobenzoyl)amino]carbonothioyl}piperaz...)
Affinity DataIC50:  3.17E+3nM
In DepthDetails PCBioAssay
LigandPNGBDBM51850(7-(4-{[(4-bromobenzoyl)amino]carbonothioyl}piperaz...)
Affinity DataEC50:  3.00E+4nM. Assay description: University of New Mexico Assay Overview: Assay Support: 1R03MH084830-01 Project Title: TR-FRET HTS Assay for Inhibitors of MEKK2-MEK5 PB1 Domain...
In DepthDetails PCBioAssay