BDBM51981 1-[4-[4-[(6-amino-2,5-dimethyl-3-imidazo[4,5-b]pyridinyl)methyl]phenyl]phenyl]ethanone::1-[4-[4-[(6-amino-2,5-dimethyl-imidazo[4,5-b]pyridin-3-yl)methyl]phenyl]phenyl]ethanone::1-[4-[4-[(6-amino-2,5-dimethylimidazo[4,5-b]pyridin-3-yl)methyl]phenyl]phenyl]ethanone::1-[4-[4-[(6-azanyl-2,5-dimethyl-imidazo[4,5-b]pyridin-3-yl)methyl]phenyl]phenyl]ethanone::MLS000718474::SMR000290742::cid_1437874
SMILES CC(=O)c1ccc(cc1)-c1ccc(Cn2c(C)nc3cc(N)c(C)nc23)cc1
InChI Key InChIKey=OCEBEYZKSLTKGZ-UHFFFAOYSA-N
Data  4 IC50  1 EC50
  Tab Delimited (TSV)   2D SDfile   Computed 3D by Vconf -m prep SDfile
Find this compound or compounds like it in BindingDB:
Activity Spreadsheet -- Enzyme Inhibition Constant Data from BindingDB
Found 5 hits for monomerid = 51981
TargetBeta-lactamase(Pseudomonas aeruginosa)
The Scripps Research Institute Molecular Screening Center
Curated by PubChem BioAssay
LigandPNGBDBM51981(1-[4-[4-[(6-amino-2,5-dimethyl-3-imidazo[4,5-b]pyr...)
Affinity DataIC50:  5.96E+4nM. Assay description: Source (MLPCN Center Name): The Scripps Research Institute Molecular Screening Center (SRIMSC) Center Affiliation: The Scripps Research Institute (TS...
In DepthDetails PCBioAssay
TargetBeta-lactamase(Pseudomonas aeruginosa)
The Scripps Research Institute Molecular Screening Center
Curated by PubChem BioAssay
LigandPNGBDBM51981(1-[4-[4-[(6-amino-2,5-dimethyl-3-imidazo[4,5-b]pyr...)
Affinity DataIC50:  5.96E+4nM. Assay description: Source (MLPCN Center Name): The Scripps Research Institute Molecular Screening Center (SRIMSC) Center Affiliation: The Scripps Research Institute (TS...
In DepthDetails PCBioAssay
TargetImportin subunit alpha-1(Homo sapiens (Human))
Broad Institute
Curated by PubChem BioAssay
LigandPNGBDBM51981(1-[4-[4-[(6-amino-2,5-dimethyl-3-imidazo[4,5-b]pyr...)
Affinity DataEC50: >5.00E+5nM. Assay description: Keywords: Counterscreen, FRET assay, HTS, YIC probe, Dose response, Assay Overview: This is a fluorescence resonance energy transfer (FRET)-based b...
In DepthDetails PCBioAssay
TargetBeta-lactamase(Pseudomonas aeruginosa)
The Scripps Research Institute Molecular Screening Center
Curated by PubChem BioAssay
LigandPNGBDBM51981(1-[4-[4-[(6-amino-2,5-dimethyl-3-imidazo[4,5-b]pyr...)
Affinity DataIC50:  5.96E+4nM. Assay description: Source (MLPCN Center Name): The Scripps Research Institute Molecular Screening Center (SRIMSC) Center Affiliation: The Scripps Research Institute (TS...
In DepthDetails PCBioAssay
TargetBeta-lactamase(Pseudomonas aeruginosa)
The Scripps Research Institute Molecular Screening Center
Curated by PubChem BioAssay
LigandPNGBDBM51981(1-[4-[4-[(6-amino-2,5-dimethyl-3-imidazo[4,5-b]pyr...)
Affinity DataIC50:  6.29E+3nM. Assay description: Source (MLPCN Center Name): The Scripps Research Institute Molecular Screening Center (SRIMSC) Center Affiliation: The Scripps Research Institute (TS...
In DepthDetails PCBioAssay