BDBM52082 4-methyl-5-[(3-methylpiperidin-1-yl)methyl]-6-oxidanyl-2-oxidanylidene-1-propyl-pyridine-3-carbonitrile::6-Hydroxy-4-methyl-5-(3-methyl-piperidin-1-ylmethyl)-2-oxo-1-propyl-1,2-dihydro-pyridine-3-carbonitrile::6-hydroxy-2-keto-4-methyl-5-[(3-methylpiperidino)methyl]-1-propyl-nicotinonitrile::6-hydroxy-4-methyl-5-[(3-methyl-1-piperidinyl)methyl]-2-oxo-1-propyl-3-pyridinecarbonitrile::6-hydroxy-4-methyl-5-[(3-methylpiperidin-1-yl)methyl]-2-oxo-1-propylpyridine-3-carbonitrile::MLS000068370::SMR000013328::cid_656096
SMILES CCCn1c(O)c(CN2CCCC(C)C2)c(C)c(C#N)c1=O
InChI Key InChIKey=RXOABCXKDBQJCL-UHFFFAOYSA-N
Data  2 IC50  4 EC50
  Tab Delimited (TSV)   2D SDfile   Computed 3D by Vconf -m prep SDfile
Find this compound or compounds like it in BindingDB:
Activity Spreadsheet -- Enzyme Inhibition Constant Data from BindingDB
Found 6 hits for monomerid = 52082
TargetPOsterior Segregation(Caenorhabditis elegans)
Broad Institute
Curated by PubChem BioAssay
LigandPNGBDBM52082(4-methyl-5-[(3-methylpiperidin-1-yl)methyl]-6-oxid...)
Affinity DataEC50:  3.00E+5nM. Assay description: Broad Institute: MLPCN maternal gene expression Project ID: 2024 Keywords: Zinc finger, C. elegans, maternal gene expression, RNA-protein interac...
In DepthDetails PCBioAssay
TargetZinc finger protein mex-5(Caenorhabditis elegans)
Broad Institute
Curated by PubChem BioAssay
LigandPNGBDBM52082(4-methyl-5-[(3-methylpiperidin-1-yl)methyl]-6-oxid...)
Affinity DataEC50:  6.60E+3nM. Assay description: Broad Institute: MLPCN maternal gene expression Project ID: 2024 Keywords: Zinc finger, C. elegans, maternal gene expression, RNA-protein interac...
In DepthDetails PCBioAssay
TargetGuanine nucleotide-binding protein subunit alpha-15(Homo sapiens (Human))
The Scripps Research Institute Molecular Screening Center
Curated by PubChem BioAssay
LigandPNGBDBM52082(4-methyl-5-[(3-methylpiperidin-1-yl)methyl]-6-oxid...)
Affinity DataIC50: >2.99E+4nM
In DepthDetails PCBioAssay
TargetTrace amine-associated receptor 1(Homo sapiens (Human))
The Scripps Research Institute Molecular Screening Center
Curated by PubChem BioAssay
LigandPNGBDBM52082(4-methyl-5-[(3-methylpiperidin-1-yl)methyl]-6-oxid...)
Affinity DataIC50:  1.30E+4nM
In DepthDetails PCBioAssay
TargetTrace amine-associated receptor 1(Homo sapiens (Human))
The Scripps Research Institute Molecular Screening Center
Curated by PubChem BioAssay
LigandPNGBDBM52082(4-methyl-5-[(3-methylpiperidin-1-yl)methyl]-6-oxid...)
Affinity DataEC50:  3.04E+3nM
In DepthDetails PCBioAssay
TargetGuanine nucleotide-binding protein subunit alpha-15(Homo sapiens (Human))
The Scripps Research Institute Molecular Screening Center
Curated by PubChem BioAssay
LigandPNGBDBM52082(4-methyl-5-[(3-methylpiperidin-1-yl)methyl]-6-oxid...)
Affinity DataEC50: >2.99E+4nM
In DepthDetails PCBioAssay