BDBM52114 2-azanylidene-N-ethyl-10-methyl-1-[(4-methylphenyl)methyl]-5-oxidanylidene-dipyrido[3,4-c:1',2'-f]pyrimidine-3-carboxamide::MLS000078664::N-ethyl-2-imino-10-methyl-1-[(4-methylphenyl)methyl]-5-oxo-3-dipyrido[3,4-c:1',2'-f]pyrimidinecarboxamide::N-ethyl-2-imino-10-methyl-1-[(4-methylphenyl)methyl]-5-oxodipyrido[3,4-c:1',2'-f]pyrimidine-3-carboxamide::N-ethyl-2-imino-5-keto-10-methyl-1-(4-methylbenzyl)dipyrido[3,4-c:1',2'-f]pyrimidine-3-carboxamide::SMR000041742::cid_661014
SMILES CCNC(=O)c1cc2c(nc3c(C)cccn3c2=O)n(Cc2ccc(C)cc2)c1=N
InChI Key InChIKey=PWIFMPSYRGQJEE-UHFFFAOYSA-N
Data  2 EC50
  Tab Delimited (TSV)   2D SDfile   Computed 3D by Vconf -m prep SDfile
Find this compound or compounds like it in BindingDB:
Activity Spreadsheet -- Enzyme Inhibition Constant Data from BindingDB
Found 2 hits for monomerid = 52114
TargetZinc finger protein mex-5(Caenorhabditis elegans)
Broad Institute
Curated by PubChem BioAssay
LigandPNGBDBM52114(2-azanylidene-N-ethyl-10-methyl-1-[(4-methylphenyl...)
Affinity DataEC50:  4.55E+4nM. Assay description: Broad Institute: MLPCN maternal gene expression Project ID: 2024 Keywords: Zinc finger, C. elegans, maternal gene expression, RNA-protein interac...
In DepthDetails PCBioAssay
TargetPOsterior Segregation(Caenorhabditis elegans)
Broad Institute
Curated by PubChem BioAssay
LigandPNGBDBM52114(2-azanylidene-N-ethyl-10-methyl-1-[(4-methylphenyl...)
Affinity DataEC50:  3.00E+5nM. Assay description: Broad Institute: MLPCN maternal gene expression Project ID: 2024 Keywords: Zinc finger, C. elegans, maternal gene expression, RNA-protein interac...
In DepthDetails PCBioAssay