BDBM52185 MLS000064288::N-(2,4-di-4-morpholinylphenyl)-2-phenylacetamide::N-(2,4-dimorpholin-4-ylphenyl)-2-phenyl-ethanamide::N-(2,4-dimorpholin-4-ylphenyl)-2-phenylacetamide::N-(2,4-dimorpholinophenyl)-2-phenyl-acetamide::N-[2,4-bis(4-morpholinyl)phenyl]-2-phenylacetamide::SMR000076386::cid_2204449
SMILES O=C(Cc1ccccc1)Nc1ccc(cc1N1CCOCC1)N1CCOCC1
InChI Key InChIKey=LXQNLKDSVAWVTK-UHFFFAOYSA-N
Data  2 EC50
  Tab Delimited (TSV)   2D SDfile   Computed 3D by Vconf -m prep SDfile
Find this compound or compounds like it in BindingDB:
Activity Spreadsheet -- Enzyme Inhibition Constant Data from BindingDB
Found 2 hits for monomerid = 52185
TargetZinc finger protein mex-5(Caenorhabditis elegans)
Broad Institute
Curated by PubChem BioAssay
LigandPNGBDBM52185(MLS000064288 | N-(2,4-di-4-morpholinylphenyl)-2-ph...)
Affinity DataEC50:  3.00E+5nM. Assay description: Broad Institute: MLPCN maternal gene expression Project ID: 2024 Keywords: Zinc finger, C. elegans, maternal gene expression, RNA-protein interac...
In DepthDetails PCBioAssay
TargetPOsterior Segregation(Caenorhabditis elegans)
Broad Institute
Curated by PubChem BioAssay
LigandPNGBDBM52185(MLS000064288 | N-(2,4-di-4-morpholinylphenyl)-2-ph...)
Affinity DataEC50:  3.00E+5nM. Assay description: Broad Institute: MLPCN maternal gene expression Project ID: 2024 Keywords: Zinc finger, C. elegans, maternal gene expression, RNA-protein interac...
In DepthDetails PCBioAssay