BDBM52263 2-[(3-chlorobenzyl)thio]-3H-imidazo[4,5-c]pyridine::2-[(3-chlorophenyl)methylsulfanyl]-3H-imidazo[4,5-c]pyridine::2-[(3-chlorophenyl)methylthio]-3H-imidazo[4,5-c]pyridine::MLS000522807::SMR000128073::cid_4058808
SMILES Clc1cccc(CSc2nc3ccncc3[nH]2)c1
InChI Key InChIKey=XJYOWBQQHMLJQL-UHFFFAOYSA-N
Data  2 EC50
  Tab Delimited (TSV)   2D SDfile   Computed 3D by Vconf -m prep SDfile
Find this compound or compounds like it in BindingDB:
Activity Spreadsheet -- Enzyme Inhibition Constant Data from BindingDB
Found 2 hits for monomerid = 52263
TargetZinc finger protein mex-5(Caenorhabditis elegans)
Broad Institute
Curated by PubChem BioAssay
LigandPNGBDBM52263(2-[(3-chlorobenzyl)thio]-3H-imidazo[4,5-c]pyridine...)
Affinity DataEC50:  3.00E+5nM. Assay description: Broad Institute: MLPCN maternal gene expression Project ID: 2024 Keywords: Zinc finger, C. elegans, maternal gene expression, RNA-protein interac...
In DepthDetails PCBioAssay
TargetPOsterior Segregation(Caenorhabditis elegans)
Broad Institute
Curated by PubChem BioAssay
LigandPNGBDBM52263(2-[(3-chlorobenzyl)thio]-3H-imidazo[4,5-c]pyridine...)
Affinity DataEC50:  3.00E+5nM. Assay description: Broad Institute: MLPCN maternal gene expression Project ID: 2024 Keywords: Zinc finger, C. elegans, maternal gene expression, RNA-protein interac...
In DepthDetails PCBioAssay