BDBM52287 4-[3-(5-Furan-2-yl-2H-pyrazol-3-yl)-5-mercapto-[1,2,4]triazol-4-yl]-benzoic acid::4-[3-[5-(2-furanyl)-1H-pyrazol-3-yl]-5-sulfanylidene-1H-1,2,4-triazol-4-yl]benzoic acid::4-[3-[5-(2-furyl)-1H-pyrazol-3-yl]-5-thioxo-1H-1,2,4-triazol-4-yl]benzoic acid::4-[3-[5-(furan-2-yl)-1H-pyrazol-3-yl]-5-sulfanylidene-1H-1,2,4-triazol-4-yl]benzoic acid::MLS000551487::SMR000145412::cid_1839198
SMILES OC(=O)c1ccc(cc1)-n1c(n[nH]c1=S)-c1cc([nH]n1)-c1ccco1
InChI Key InChIKey=IEPBFGDXTHAEIK-UHFFFAOYSA-N
Data  9 IC50  2 EC50
  Tab Delimited (TSV)   2D SDfile   Computed 3D by Vconf -m prep SDfile
Find this compound or compounds like it in BindingDB:
Activity Spreadsheet -- Enzyme Inhibition Constant Data from BindingDB
Found 11 hits for monomerid = 52287
TargetPOsterior Segregation(Caenorhabditis elegans)
Broad Institute
Curated by PubChem BioAssay
LigandPNGBDBM52287(4-[3-(5-Furan-2-yl-2H-pyrazol-3-yl)-5-mercapto-[1,...)
Affinity DataEC50:  4.19E+3nM. Assay description: Broad Institute: MLPCN maternal gene expression Project ID: 2024 Keywords: Zinc finger, C. elegans, maternal gene expression, RNA-protein interac...
In DepthDetails PCBioAssay
TargetZinc finger protein mex-5(Caenorhabditis elegans)
Broad Institute
Curated by PubChem BioAssay
LigandPNGBDBM52287(4-[3-(5-Furan-2-yl-2H-pyrazol-3-yl)-5-mercapto-[1,...)
Affinity DataEC50:  4.74E+3nM. Assay description: Broad Institute: MLPCN maternal gene expression Project ID: 2024 Keywords: Zinc finger, C. elegans, maternal gene expression, RNA-protein interac...
In DepthDetails PCBioAssay
TargetGlucose-6-phosphate 1-dehydrogenase(Homo sapiens (Human))
Burnham Center For Chemical Genomics
Curated by PubChem BioAssay
LigandPNGBDBM52287(4-[3-(5-Furan-2-yl-2H-pyrazol-3-yl)-5-mercapto-[1,...)
Affinity DataIC50: >8.00E+4nM. Assay description: Data Source: Sanford-Burnham Center for Chemical Genomics (SBCCG) Source Affiliation: Sanford-Burnham Medical Research Institute (SBMRI, San Diego CA...
In DepthDetails PCBioAssay
TargetGlucose-6-phosphate dehydrogenase-6-phosphogluconolactonase(Plasmodium falciparum 3D7)
Burnham Center For Chemical Genomics
Curated by PubChem BioAssay
LigandPNGBDBM52287(4-[3-(5-Furan-2-yl-2H-pyrazol-3-yl)-5-mercapto-[1,...)
Affinity DataIC50:  2.75E+4nM. Assay description: Data Source: Sanford-Burnham Center for Chemical Genomics (SBCCG) Source Affiliation: Sanford-Burnham Medical Research Institute (SBMRI, San Diego CA...
In DepthDetails PCBioAssay
TargetGlucose-6-phosphate dehydrogenase-6-phosphogluconolactonase(Plasmodium falciparum 3D7)
Burnham Center For Chemical Genomics
Curated by PubChem BioAssay
LigandPNGBDBM52287(4-[3-(5-Furan-2-yl-2H-pyrazol-3-yl)-5-mercapto-[1,...)
Affinity DataIC50: >8.00E+4nM. Assay description: Data Source: Sanford-Burnham Center for Chemical Genomics (SBCCG) Source Affiliation: Sanford-Burnham Medical Research Institute (SBMRI, San Diego CA...
In DepthDetails PCBioAssay
Target1-phosphatidylinositol 4,5-bisphosphate phosphodiesterase beta-3(Homo sapiens (Human))
The Scripps Research Institute Molecular Screening Center
Curated by PubChem BioAssay
LigandPNGBDBM52287(4-[3-(5-Furan-2-yl-2H-pyrazol-3-yl)-5-mercapto-[1,...)
Affinity DataIC50:  1.22E+5nM. Assay description: Source (MLPCN Center Name): The Scripps Research Institute Molecular Screening Center (SRIMSC) Center Affiliation: The Scripps Research Institute Ass...
In DepthDetails PCBioAssay
TargetCarboxy-terminal domain RNA polymerase II polypeptide A small phosphatase 1(Homo sapiens (Human))
Burnham Center For Chemical Genomics
Curated by PubChem BioAssay
LigandPNGBDBM52287(4-[3-(5-Furan-2-yl-2H-pyrazol-3-yl)-5-mercapto-[1,...)
Affinity DataIC50:  1.60E+3nM. Assay description: Data Source: Sanford-Burnham Center for Chemical Genomics (SBCCG) Source Affiliation: Sanford-Burnham Medical Research Institute (SBMRI, San Diego, C...
In DepthDetails PCBioAssay
Target1-phosphatidylinositol 4,5-bisphosphate phosphodiesterase gamma-1 [1-999,I813T](Homo sapiens (Human))
The Scripps Research Institute Molecular Screening Center
Curated by PubChem BioAssay
LigandPNGBDBM52287(4-[3-(5-Furan-2-yl-2H-pyrazol-3-yl)-5-mercapto-[1,...)
Affinity DataIC50:  1.02E+5nM. Assay description: Source (MLPCN Center Name): The Scripps Research Institute Molecular Screening Center (SRIMSC) Center Affiliation: The Scripps Research Institute Ass...
In DepthDetails PCBioAssay
TargetPC4 and SFRS1-interacting protein(Homo sapiens (Human))
The Scripps Research Institute Molecular Screening Center
Curated by PubChem BioAssay
LigandPNGBDBM52287(4-[3-(5-Furan-2-yl-2H-pyrazol-3-yl)-5-mercapto-[1,...)
Affinity DataIC50:  5.37E+4nM. Assay description: Source (MLPCN Center Name): The Scripps Research Institute Molecular Screening Center (SRIMSC) Affiliation: Ohio State University Assay Provider: Mam...
In DepthDetails PCBioAssay
TargetPC4 and SFRS1-interacting protein(Homo sapiens (Human))
The Scripps Research Institute Molecular Screening Center
Curated by PubChem BioAssay
LigandPNGBDBM52287(4-[3-(5-Furan-2-yl-2H-pyrazol-3-yl)-5-mercapto-[1,...)
Affinity DataIC50:  7.32E+3nM. Assay description: Source (MLPCN Center Name): The Scripps Research Institute Molecular Screening Center (SRIMSC) Affiliation: Ohio State University Assay Provider: Mam...
In DepthDetails PCBioAssay
TargetGlucose-6-phosphate dehydrogenase-6-phosphogluconolactonase(Plasmodium falciparum 3D7)
Burnham Center For Chemical Genomics
Curated by PubChem BioAssay
LigandPNGBDBM52287(4-[3-(5-Furan-2-yl-2H-pyrazol-3-yl)-5-mercapto-[1,...)
Affinity DataIC50:  4.08E+4nM. Assay description: Data Source: Sanford-Burnham Center for Chemical Genomics (SBCCG) Source Affiliation: Sanford-Burnham Medical Research Institute (SBMRI, San Diego CA...
In DepthDetails PCBioAssay